Ask is moving to Stack Overflow and Serverfault.com! Please use the "opendaylight" tag on either of these sites. This site is now in Read-Only mode

Abhishek's profile - activity

2015-03-26 11:25:47 -0700 received badge  Famous Question (source)
2015-03-10 03:54:41 -0700 received badge  Famous Question (source)
2015-02-17 20:08:21 -0700 received badge  Notable Question (source)
2015-02-17 09:20:44 -0700 received badge  Enthusiast
2015-02-13 02:23:59 -0700 received badge  Popular Question (source)
2015-02-11 13:40:39 -0700 asked a question OpenDayLight API Documentation

Hey, Has the location of the ODL API Javadocs moved elsewhere? All the links on the wiki pages are leading to a not found error on Jenkins. Could someone please point me to the new location?

Regards, Abhishek.

2015-02-08 19:38:34 -0700 received badge  Notable Question (source)
2015-02-07 18:34:54 -0700 received badge  Popular Question (source)
2015-02-06 13:31:54 -0700 asked a question OpenDayLight-Helium-SR2 build fails due to test failure in netconf-ssh

I am trying to build the ODL controller from the Git repository. It fails complaining about a failed test case from netconf-ssh. Here is my log. Could someone please tell me how to fix this? I have been trying to build the base controller for more than a day now. Don't know if I am doing something wrong. :)

[INFO] netconf-config .................................... SUCCESS [ 0.137 s]

[INFO] netconf-auth ...................................... SUCCESS [ 0.349 s]

[INFO] netconf-ssh ....................................... FAILURE [ 18.559 s]

[INFO] ------------------------------------------------------------------------

[INFO] BUILD FAILURE

[INFO] ------------------------------------------------------------------------

[INFO] Total time: 09:58 min

[INFO] Finished at: 2015-02-06T16:14:32-05:00

[INFO] Final Memory: 328M/804M

[INFO] ------------------------------------------------------------------------

[ERROR] Failed to execute goal org.apache.maven.plugins:maven-surefire-plugin:2.18:test (default-test) on project netconf-ssh: There are test failures.

[ERROR]

[ERROR] Please refer to /Users/Abhishek/Documents/GitHub-Repos/ODL-Karaf/opendaylight/netconf/netconf-ssh/target/surefire-reports for the individual test results.

[ERROR] -> [Help 1] [ERROR] [ERROR] To see the full stack trace of the errors, re-run Maven with the -e switch.

[ERROR] Re-run Maven using the -X switch to enable full debug logging.

[ERROR] [ERROR] For more information about the errors and possible solutions, please read the following articles:

[ERROR] [Help 1] http://cwiki.apache.org/confluence/display/MAVEN/MojoFailureException

[ERROR] [ERROR] After correcting the problems, you can resume the build with the command [ERROR] mvn <goals> -rf :netconf-ssh</goals>

Here is the output from the surefire-log for netconf-ssh.


2 Test set: org.opendaylight.controller.netconf.netty.SSHTest 3 ------------------------------------------------------------------------------- 4 Tests run: 2, Failures: 1, Errors: 0, Skipped: 0, Time elapsed: 12.404 sec <<< FAILURE! - in org.opendaylight.controller.netconf.netty.SSHTest 5 testClientWithoutServer(org.opendaylight.controller.netconf.netty.SSHTest) Time elapsed: 5.1 sec <<< FAILURE! 6 java.lang.AssertionError: expected:<FAILEDTOCONNECT> but was:<CONNECTING> 7 at org.junit.Assert.fail(Assert.java:88) 8 at org.junit.Assert.failNotEquals(Assert.java:743) 9 at org.junit.Assert.assertEquals(Assert.java:118) 10 at org.junit.Assert.assertEquals(Assert.java:144) 11 at org.opendaylight.controller.netconf.netty.SSHTest.testClientWithoutServer(SSHTest.java:139)

2015-02-05 19:33:34 -0700 answered a question Maven build fails on project features-base

Basically, the pom.xml listing in features-base is trying to pull in version 3.0.0 (which is provided it to it by the variable in the pom). You can try commenting that statement out in the pom and replacing it with an exact version that is present on Nexus. For example, try <version>4.4.0</version> and see if it works. Although I am not sure what problems may arise by using a higher level version for the same artifact. You could give it a shot.