Ask is moving to Stack Overflow and Serverfault.com! Please use the "opendaylight" tag on either of these sites. This site is now in Read-Only mode

Revision history [back]

click to hide/show revision 1
initial version

Trying to integrate the OpenStack Juno with Helium release of Opendaylight getting the error

I followed the link for the integartion https://wiki.opendaylight.org/view/OpenStackandOpenDaylight. Every thing went well. When checking for the curl call getting the error. Don't get confuse the. I used the 8181 port in the config file of the ml2_conf.ini for the url.

"curl -u admin:admin http://192.168.15.193:8181/controller/nb/v2/neutron/networks"

OUTPUT for the call

<html> <head> <meta http-equiv="Content-Type" content="text/html;charset=ISO-8859-1"/> <title>Error 404 Not Found</title> </head> <body>

HTTP ERROR: 404

Problem accessing /controller/nb/v2/neutron/networks. Reason:

    Not Found


Powered by Jetty://

</body> </html>

Karaf.log

Mar 10, 2015 4:27:42 AM org.apache.karaf.main.lock.SimpleFileLock lock INFO: Trying to lock /opt/stack/opendaylight/distribution-karaf-0.2.2-Helium-SR2/lock Mar 10, 2015 4:27:42 AM org.apache.karaf.main.lock.SimpleFileLock lock INFO: Lock acquired Mar 10, 2015 4:27:42 AM org.apache.karaf.main.Main$KarafLockCallback lockAquired INFO: Lock acquired. Setting startlevel to 100 2015-03-10 04:27:44,671 | INFO | Event Dispatcher | FeaturesServiceImpl | 24 - org.apache.karaf.features.core - 3.0.1 | Installing feature region 3.0.1 2015-03-10 04:29:03,558 | WARN | Event Dispatcher | AetherBasedResolver | 5 - org.ops4j.pax.url.mvn - 1.6.0 | Error resolving artifactorg.eclipse.equinox:region:jar:1.0.0.v20110506:Could not transfer artifact org.eclipse.equinox:region:jar:1.0.0.v20110506 from/to central (http://repo1.maven.org/maven2/): Error transferring file: Connection refused org.sonatype.aether.resolution.ArtifactResolutionException: Could not transfer artifact org.eclipse.equinox:region:jar:1.0.0.v20110506 from/to central (http://repo1.maven.org/maven2/): Error transferring file: Connection refused at org.sonatype.aether.impl.internal.DefaultArtifactResolver.resolve(DefaultArtifactResolver.java:538) at org.sonatype.aether.impl.internal.DefaultArtifactResolver.resolveArtifacts(DefaultArtifactResolver.java:216) at org.sonatype.aether.impl.internal.DefaultArtifactResolver.resolveArtifact(DefaultArtifactResolver.java:193) at org.sonatype.aether.impl.internal.DefaultRepositorySystem.resolveArtifact(DefaultRepositorySystem.java:286) at org.ops4j.pax.url.mvn.internal.AetherBasedResolver.resolve(AetherBasedResolver.java:250) at org.ops4j.pax.url.mvn.internal.AetherBasedResolver.resolveFile(AetherBasedResolver.java:239) at org.ops4j.pax.url.mvn.internal.AetherBasedResolver.resolve(AetherBasedResolver.java:223) at org.ops4j.pax.url.mvn.internal.Connection.getInputStream(Connection.java:122) at java.net.URL.openStream(URL.java:1037)[:1.7.075] at org.apache.karaf.features.internal.BundleManager.getInputStreamForBundle(BundleManager.java:173) at org.apache.karaf.features.internal.BundleManager.doInstallBundleIfNeeded(BundleManager.java:92) at org.apache.karaf.features.internal.BundleManager.installBundleIfNeeded(BundleManager.java:86) at org.apache.karaf.features.internal.FeaturesServiceImpl.doInstallFeature(FeaturesServiceImpl.java:529) at org.apache.karaf.features.internal.FeaturesServiceImpl.installFeatures(FeaturesServiceImpl.java:393) at org.apache.karaf.features.internal.BootFeaturesInstaller.installBootFeatures(BootFeaturesInstaller.java:92) at org.apache.karaf.features.internal.BootFeaturesInstaller.start(BootFeaturesInstaller.java:76) at sun.reflect.NativeMethodAccessorImpl.invoke0(Native Method)[:1.7.075] at sun.reflect.NativeMethodAccessorImpl.invoke(NativeMethodAccessorImpl.java:57)[:1.7.075] at sun.reflect.DelegatingMethodAccessorImpl.invoke(DelegatingMethodAccessorImpl.java:43)[:1.7.075] at java.lang.reflect.Method.invoke(Method.java:606)[:1.7.075] at org.apache.aries.blueprint.utils.ReflectionUtils.invoke(ReflectionUtils.java:297)[19:org.apache.aries.blueprint.core:1.4.0] at org.apache.aries.blueprint.container.BeanRecipe.invoke(BeanRecipe.java:958)[19:org.apache.aries.blueprint.core:1.4.0] at org.apache.aries.blueprint.container.BeanRecipe.runBeanProcInit(BeanRecipe.java:712)[19:org.apache.aries.blueprint.core:1.4.0] at org.apache.aries.blueprint.container.BeanRecipe.internalCreate2(BeanRecipe.java:824)[19:org.apache.aries.blueprint.core:1.4.0] at org.apache.aries.blueprint.container.BeanRecipe.internalCreate(BeanRecipe.java:787)[19:org.apache.aries.blueprint.core:1.4.0] at org.apache.aries.blueprint.di.AbstractRecipe$1.call(AbstractRecipe.java:79)[19:org.apache.aries.blueprint.core:1.4.0] at java.util.concurrent.FutureTask.run(FutureTask.java:262)[:1.7.075] at org.apache.aries.blueprint.di.AbstractRecipe.create(AbstractRecipe.java:88)[19:org.apache.aries.blueprint.core:1.4.0] at org.apache.aries.blueprint.container.BlueprintRepository.createInstances(BlueprintRepository.java:245)[19:org.apache.aries.blueprint.core:1.4.0] at org.apache.aries.blueprint.container.BlueprintRepository.createAll(BlueprintRepository.java:183)[19:org.apache.aries.blueprint.core:1.4.0] at org.apache.aries.blueprint.container.BlueprintContainerImpl.instantiateEagerComponents(BlueprintContainerImpl.java:681)[19:org.apache.aries.blueprint.core:1.4.0] at org.apache.aries.blueprint.container.BlueprintContainerImpl.doRun(BlueprintContainerImpl.java:378)[19:org.apache.aries.blueprint.core:1.4.0] at org.apache.aries.blueprint.container.BlueprintContainerImpl.run(BlueprintContainerImpl.java:269)[19:org.apache.aries.blueprint.core:1.4.0] at org.apache.aries.blueprint.container.BlueprintExtender.createContainer(BlueprintExtender.java:276)[19:org.apache.aries.blueprint.core:1.4.0] at org.apache.aries.blueprint.container.BlueprintExtender.createContainer(BlueprintExtender.java:245)[19:org.apache.aries.blueprint.core:1.4.0] at org.apache.aries.blueprint.container.BlueprintExtender.modifiedBundle(BlueprintExtender.java:235)[19:org.apache.aries.blueprint.core:1.4.0] at org.apache.aries.util.tracker.hook.BundleHookBundleTracker$Tracked.customizerModified(BundleHookBundleTracker.java:500)[13:org.apache.aries.util:1.1.0] at org.apache.aries.util.tracker.hook.BundleHookBundleTracker$Tracked.customizerModified(BundleHookBundleTracker.java:433)[13:org.apache.aries.util:1.1.0] at org.apache.aries.util.tracker.hook.BundleHookBundleTracker$AbstractTracked.track(BundleHookBundleTracker.java:725)[13:org.apache.aries.util:1.1.0] at org.apache.aries.util.tracker.hook.BundleHookBundleTracker$Tracked.bundleChanged(BundleHookBundleTracker.java:463)[13:org.apache.aries.util:1.1.0] at org.apache.aries.util.tracker.hook.BundleHookBundleTracker$BundleEventHook.event(BundleHookBundleTracker.java:422)[13:org.apache.aries.util:1.1.0] at org.eclipse.osgi.framework.internal.core.Framework$10.call(Framework.java:1605)[org.eclipse.osgi-3.8.2.v20130124-134944.jar:] at org.eclipse.osgi.internal.serviceregistry.ServiceRegistry.notifyHookPrivileged(ServiceRegistry.java:1239)[org.eclipse.osgi-3.8.2.v20130124-134944.jar:] at org.eclipse.osgi.internal.serviceregistry.ServiceRegistry.notifyHooksPrivileged(ServiceRegistry.java:1222)[org.eclipse.osgi-3.8.2.v20130124-134944.jar:] at org.eclipse.osgi.framework.internal.core.Framework.notifyEventHooksPrivileged(Framework.java:1602)[org.eclipse.osgi-3.8.2.v20130124-134944.jar:] at org.eclipse.osgi.framework.internal.core.Framework.publishBundleEventPrivileged(Framework.java:1557)[org.eclipse.osgi-3.8.2.v20130124-134944.jar:] at org.eclipse.osgi.framework.internal.core.Framework.publishBundleEvent(Framework.java:1504)[org.eclipse.osgi-3.8.2.v20130124-134944.jar:] at org.eclipse.osgi.framework.internal.core.Framework.publishBundleEvent(Framework.java:1499)[org.eclipse.osgi-3.8.2.v20130124-134944.jar:] at org.eclipse.osgi.framework.internal.core.BundleHost.startWorker(BundleHost.java:391)[org.eclipse.osgi-3.8.2.v20130124-134944.jar:] at org.eclipse.osgi.framework.internal.core.AbstractBundle.resume(AbstractBundle.java:390)[org.eclipse.osgi-3.8.2.v20130124-134944.jar:] at org.eclipse.osgi.framework.internal.core.Framework.resumeBundle(Framework.java:1176)[org.eclipse.osgi-3.8.2.v20130124-134944.jar:] at org.eclipse.osgi.framework.internal.core.StartLevelManager.resumeBundles(StartLevelManager.java:559)[org.eclipse.osgi-3.8.2.v20130124-134944.jar:] at org.eclipse.osgi.framework.internal.core.StartLevelManager.resumeBundles(StartLevelManager.java:544)[org.eclipse.osgi-3.8.2.v20130124-134944.jar:] at org.eclipse.osgi.framework.internal.core.StartLevelManager.incFWSL(StartLevelManager.java:457)[org.eclipse.osgi-3.8.2.v20130124-134944.jar:] at org.eclipse.osgi.framework.internal.core.StartLevelManager.doSetStartLevel(StartLevelManager.java:243)[org.eclipse.osgi-3.8.2.v20130124-134944.jar:] at org.eclipse.osgi.framework.internal.core.StartLevelManager.dispatchEvent(StartLevelManager.java:438)[org.eclipse.osgi-3.8.2.v20130124-134944.jar:] at org.eclipse.osgi.framework.internal.core.StartLevelManager.dispatchEvent(StartLevelManager.java:1)[org.eclipse.osgi-3.8.2.v20130124-134944.jar:] at org.eclipse.osgi.framework.eventmgr.EventManager.dispatchEvent(EventManager.java:230)[org.eclipse.osgi-3.8.2.v20130124-134944.jar:] at org.eclipse.osgi.framework.eventmgr.EventManager$EventThread.run(EventManager.java:340)[org.eclipse.osgi-3.8.2.v20130124-134944.jar:] Caused by: org.sonatype.aether.transfer.ArtifactTransferException: Could not transfer artifact org.eclipse.equinox:region:jar:1.0.0.v20110506 from/to central (http://repo1.maven.org/maven2/): Error transferring file: Connection refused at org.sonatype.aether.connector.wagon.WagonRepositoryConnector$4.wrap(WagonRepositoryConnector.java:951)[5:org.ops4j.pax.url.mvn:1.6.0] at org.sonatype.aether.connector.wagon.WagonRepositoryConnector$4.wrap(WagonRepositoryConnector.java:941)[5:org.ops4j.pax.url.mvn:1.6.0] at org.sonatype.aether.connector.wagon.WagonRepositoryConnector$GetTask.run(WagonRepositoryConnector.java:669)[5:org.ops4j.pax.url.mvn:1.6.0] at org.sonatype.aether.util.concurrency.RunnableErrorForwarder$1.run(RunnableErrorForwarder.java:60)[5:org.ops4j.pax.url.mvn:1.6.0] at java.util.concurrent.ThreadPoolExecutor.runWorker(ThreadPoolExecutor.java:1145)[:1.7.075] at java.util.concurrent.ThreadPoolExecutor$Worker.run(ThreadPoolExecutor.java:615)[:1.7.075] at java.lang.Thread.run(Thread.java:745)[:1.7.075] Caused by: org.apache.maven.wagon.TransferFailedException: Error transferring file: Connection refused at org.apache.maven.wagon.providers.http.LightweightHttpWagon.fillInputData(LightweightHttpWagon.java:143)[5:org.ops4j.pax.url.mvn:1.6.0] at org.apache.maven.wagon.StreamWagon.getInputStream(StreamWagon.java:116)[5:org.ops4j.pax.url.mvn:1.6.0] at org.apache.maven.wagon.StreamWagon.getIfNewer(StreamWagon.java:88)[5:org.ops4j.pax.url.mvn:1.6.0] at org.apache.maven.wagon.StreamWagon.get(StreamWagon.java:61)[5:org.ops4j.pax.url.mvn:1.6.0] at org.sonatype.aether.connector.wagon.WagonRepositoryConnector$GetTask.run(WagonRepositoryConnector.java:601)[5:org.ops4j.pax.url.mvn:1.6.0] ... 4 more Caused by: java.net.ConnectException: Connection refused at java.net.PlainSocketImpl.socketConnect(Native Method)[:1.7.075] at java.net.AbstractPlainSocketImpl.doConnect(AbstractPlainSocketImpl.java:339)[:1.7.075] at java.net.AbstractPlainSocketImpl.connectToAddress(AbstractPlainSocketImpl.java:200)[:1.7.075] at java.net.AbstractPlainSocketImpl.connect(AbstractPlainSocketImpl.java:182)[:1.7.075] at java.net.SocksSocketImpl.connect(SocksSocketImpl.java:392)[:1.7.075] at java.net.Socket.connect(Socket.java:579)[:1.7.075] at java.net.Socket.connect(Socket.java:528)[:1.7.075] at sun.net.NetworkClient.doConnect(NetworkClient.java:180)[:1.7.075] at sun.net.www.http.HttpClient.openServer(HttpClient.java:432)[:1.7.075] at sun.net.www.http.HttpClient.openServer(HttpClient.java:527)[:1.7.075] at sun.net.www.http.HttpClient.<init>(HttpClient.java:211)[:1.7.075] at sun.net.www.http.HttpClient.New(HttpClient.java:308)[:1.7.075] at sun.net.www.http.HttpClient.New(HttpClient.java:326)[:1.7.075] at sun.net.www.protocol.http.HttpURLConnection.getNewHttpClient(HttpURLConnection.java:997)[:1.7.075] at sun.net.www.protocol.http.HttpURLConnection.plainConnect(HttpURLConnection.java:933)[:1.7.075] at sun.net.www.protocol.http.HttpURLConnection.connect(HttpURLConnection.java:851)[:1.7.075] at sun.net.www.protocol.http.HttpURLConnection.getInputStream(HttpURLConnection.java:1301)[:1.7.075] at java.net.HttpURLConnection.getResponseCode(HttpURLConnection.java:468)[:1.7.075] at org.apache.maven.wagon.providers.http.LightweightHttpWagon.fillInputData(LightweightHttpWagon.java:115)[5:org.ops4j.pax.url.mvn:1.6.0] ... 8 more 2015-03-10 04:29:03,599 | WARN | Event Dispatcher | FeaturesServiceImpl | 24 - org.apache.karaf.features.core - 3.0.1 | Error when installing feature region: java.io.IOException: Error resolving artifact org.eclipse.equinox:region:jar:1.0.0.v20110506: Could not transfer artifact org.eclipse.equinox:region:jar:1.0.0.v20110506 from/to central (http://repo1.maven.org/maven2/): Error transferring file: Connection refused 2015-03-10 04:29:03,773 | INFO | Event Dispatcher | BlueprintContainerImpl | 19 - org.apache.aries.blueprint.core - 1.4.0 | Bundle org.apache.karaf.features.command is waiting for namespace handlers [http://karaf.apache.org/xmlns/shell/v1.1.0] 2015-03-10 04:29:03,788 | INFO | Event Dispatcher | BlueprintContainerImpl | 19 - org.apache.aries.blueprint.core - 1.4.0 | Bundle org.apache.karaf.shell.console is waiting for dependencies [(objectClass=org.apache.felix.service.threadio.ThreadIO), (objectClass=org.apache.felix.service.command.CommandProcessor)] 2015-03-10 04:29:03,798 | INFO | Event Dispatcher | BlueprintContainerImpl | 19 - org.apache.aries.blueprint.core - 1.4.0 | Bundle org.apache.karaf.jaas.modules is waiting for namespace handlers [http://karaf.apache.org/xmlns/jaas/v1.0.0] 2015-03-10 04:29:03,851 | INFO | Event Dispatcher | BlueprintContainerImpl | 19 - org.apache.aries.blueprint.core - 1.4.0 | Bundle org.apache.karaf.bundle.command is waiting for namespace handlers [http://karaf.apache.org/xmlns/shell/v1.1.0] 2015-03-10 04:29:03,947 | INFO | Event Dispatcher | BlueprintContainerImpl | 19 - org.apache.aries.blueprint.core - 1.4.0 | Bundle org.apache.karaf.shell.help is waiting for dependencies [(objectClass=org.apache.felix.service.threadio.ThreadIO)] 2015-03-10 04:29:03,981 | INFO | Event Dispatcher | BlueprintContainerImpl | 19 - org.apache.aries.blueprint.core - 1.4.0 | Bundle org.apache.karaf.system.command is waiting for namespace handlers [http://karaf.apache.org/xmlns/shell/v1.1.0] 2015-03-10 04:29:03,988 | INFO | Event Dispatcher | BlueprintContainerImpl | 19 - org.apache.aries.blueprint.core - 1.4.0 | Bundle org.apache.karaf.shell.commands is waiting for namespace handlers [http://karaf.apache.org/xmlns/shell/v1.1.0] 2015-03-10 04:29:04,011 | INFO | Event Dispatcher | BlueprintContainerImpl | 19 - org.apache.aries.blueprint.core - 1.4.0 | Bundle org.apache.karaf.config.command is waiting for namespace handlers [http://karaf.apache.org/xmlns/shell/v1.1.0] 2015-03-10 04:29:04,024 | INFO | rint Extender: 1 | BlueprintContainerImpl | 19 - org.apache.aries.blueprint.core - 1.4.0 | Bundle org.apache.karaf.shell.console is waiting for dependencies [(objectClass=org.apache.felix.service.command.CommandProcessor)] 2015-03-10 04:29:04,082 | INFO | Event Dispatcher | BlueprintContainerImpl | 19 - org.apache.aries.blueprint.core - 1.4.0 | Bundle org.apache.karaf.instance.command is waiting for namespace handlers [http://karaf.apache.org/xmlns/shell/v1.1.0] 2015-03-10 04:29:04,092 | INFO | Event Dispatcher | BlueprintContainerImpl | 19 - org.apache.aries.blueprint.core - 1.4.0 | Bundle org.apache.karaf.jaas.command is waiting for namespace handlers [http://karaf.apache.org/xmlns/shell/v1.1.0] 2015-03-10 04:29:04,138 | INFO | rint Extender: 2 | SecuredCommandConfigTransformer | 37 - org.apache.karaf.shell.console - 3.0.1 | Generating command ACL config org.apache.karaf.command.acl.kar into service ACL configs [org.apache.karaf.service.acl.command.kar.install, org.apache.karaf.service.acl.command.kar.uninstall] 2015-03-10 04:29:04,169 | INFO | rint Extender: 2 | SecuredCommandConfigTransformer | 37 - org.apache.karaf.shell.console - 3.0.1 | Generating command ACL config org.apache.karaf.command.acl.feature into service ACL configs [org.apache.karaf.service.acl.command.feature.uninstall, org.apache.karaf.service.acl.command.feature.install] 2015-03-10 04:29:04,188 | INFO | rint Extender: 2 | SecuredCommandConfigTransformer | 37 - org.apache.karaf.shell.console - 3.0.1 | Generating command ACL config org.apache.karaf.command.acl.config into service ACL configs [org.apache.karaf.service.acl.command.config.property-set, org.apache.karaf.service.acl.command.config.delete, org.apache.karaf.service.acl.command.config.cancel, org.apache.karaf.service.acl.command.config.update, org.apache.karaf.service.acl.command.config.property-delete, org.apache.karaf.service.acl.command.config.property-append, org.apache.karaf.service.acl.command.config.edit] 2015-03-10 04:29:04,288 | INFO | rint Extender: 2 | SecuredCommandConfigTransformer | 37 - org.apache.karaf.shell.console - 3.0.1 | Generating command ACL config org.apache.karaf.command.acl.bundle into service ACL configs [org.apache.karaf.service.acl.command.bundle.install, org.apache.karaf.service.acl.command.bundle.uninstall, org.apache.karaf.service.acl.command.bundle.update, org.apache.karaf.service.acl.command.bundle.restart, org.apache.karaf.service.acl.command.bundle.start, org.apache.karaf.service.acl.command.bundle.stop, org.apache.karaf.service.acl.command.bundle.watch, org.apache.karaf.service.acl.command.bundle.refresh] 2015-03-10 04:29:04,310 | INFO | rint Extender: 2 | SecuredCommandConfigTransformer | 37 - org.apache.karaf.shell.console - 3.0.1 | Generating command ACL config org.apache.karaf.command.acl.shell into service ACL configs [org.apache.karaf.service.acl.command.shell.java, org.apache.karaf.service.acl.command.shell.edit, org.apache.karaf.service.acl.command.shell.exec, org.apache.karaf.service.acl.command.shell.new] 2015-03-10 04:29:04,314 | INFO | rint Extender: 2 | SecuredCommandConfigTransformer | 37 - org.apache.karaf.shell.console - 3.0.1 | Generating command ACL config org.apache.karaf.command.acl.system into service ACL configs [org.apache.karaf.service.acl.command.system.start-level, org.apache.karaf.service.acl.command.system.shutdown, org.apache.karaf.service.acl.command.system.property] 2015-03-10 04:29:04,341 | INFO | rint Extender: 2 | SecuredCommandConfigTransformer | 37 - org.apache.karaf.shell.console - 3.0.1 | Generating command ACL config org.apache.karaf.command.acl.jaas into service ACL configs [org.apache.karaf.service.acl.command.jaas.update] 2015-03-10 04:29:05,159 | INFO | Event Dispatcher | SecurityUtils | 41 - org.apache.sshd.core - 0.9.0 | BouncyCastle not registered, using the default JCE provider 2015-03-10 04:29:05,742 | INFO | Event Dispatcher | Activator | 90 - org.ops4j.pax.web.pax-web-runtime - 3.1.0 | EventAdmin support is not available, no servlet events will be posted! 2015-03-10 04:29:05,748 | INFO | Event Dispatcher | Activator | 90 - org.ops4j.pax.web.pax-web-runtime - 3.1.0 | LogService support enabled, log events will be created. 2015-03-10 04:29:05,756 | INFO | Event Dispatcher | Activator | 90 - org.ops4j.pax.web.pax-web-runtime - 3.1.0 | Pax Web started 2015-03-10 04:29:05,896 | INFO | pool-14-thread-1 | Server | 81 - org.eclipse.jetty.aggregate.jetty-all-server - 8.1.14.v20131031 | jetty-8.1.14.v20131031 2015-03-10 04:29:05,936 | INFO | pool-14-thread-1 | JettyServerImpl | 91 - org.ops4j.pax.web.pax-web-jetty - 3.1.0 | Pax Web is started with it's default configuration most likely it's listening on port 8181 2015-03-10 04:29:05,943 | INFO | pool-14-thread-1 | JettyServerImpl | 91 - org.ops4j.pax.web.pax-web-jetty - 3.1.0 | Pax Web available at [0.0.0.0]:[8181] 2015-03-10 04:29:05,967 | INFO | pool-14-thread-1 | AbstractConnector | 81 - org.eclipse.jetty.aggregate.jetty-all-server - 8.1.14.v20131031 | Started NIOSocketConnectorWrapper@0.0.0.0:8181 2015-03-10 04:29:07,028 | INFO | Event Dispatcher | HttpServiceFactoryImpl | 90 - org.ops4j.pax.web.pax-web-runtime - 3.1.0 | Binding bundle: [org.opendaylight.aaa.authn-sts0.1.2.Helium-SR2 [117]] to http service 2015-03-10 04:29:07,120 | WARN | Event Dispatcher | ConfigurationFactory | 110 - net.sf.ehcache - 2.8.3 | No configuration found. Configuring ehcache from ehcache-failsafe.xml found in the classpath: bundleresource://110.fwk626305923/ehcache-failsafe.xml 2015-03-10 04:29:07,479 | INFO | Event Dispatcher | DefaultTokenStore | 118 - org.opendaylight.aaa.authn-store - 0.1.2.Helium-SR2 | Initialized token store with default cache config 2015-03-10 04:29:07,512 | INFO | ght.aaa.tokens]) | DefaultTokenStore | 118 - org.opendaylight.aaa.authn-store - 0.1.2.Helium-SR2 | Updating token store configuration... 2015-03-10 04:29:08,008 | INFO | Event Dispatcher | HttpServiceFactoryImpl | 90 - org.ops4j.pax.web.pax-web-runtime - 3.1.0 | Binding bundle: [org.opendaylight.aaa.idmlight0.1.2.Helium-SR2 [120]] to http service 2015-03-10 04:29:08,256 | INFO | pool-15-thread-1 | WebApplicationImpl | 107 - com.sun.jersey.jersey-server - 1.17.0 | Initiating Jersey application, version 'Jersey: 1.17 01/17/2013 03:31 PM' 2015-03-10 04:29:08,396 | INFO | pool-15-thread-1 | IdmLightApplication | 120 - org.opendaylight.aaa.idmlight - 0.1.2.Helium-SR2 | starting idmlight .... 2015-03-10 04:29:08,399 | INFO | pool-15-thread-1 | IdmLightConfig | 120 - org.opendaylight.aaa.idmlight - 0.1.2.Helium-SR2 | DB Path : jdbc:sqlite:idmlight.db 2015-03-10 04:29:08,399 | INFO | pool-15-thread-1 | IdmLightConfig | 120 - org.opendaylight.aaa.idmlight - 0.1.2.Helium-SR2 | DB Driver : org.sqlite.JDBC 2015-03-10 04:29:08,399 | INFO | pool-15-thread-1 | IdmLightConfig | 120 - org.opendaylight.aaa.idmlight - 0.1.2.Helium-SR2 | DB Valid Time Out : 3 2015-03-10 04:29:08,404 | INFO | pool-15-thread-1 | DeferredResourceConfig | 107 - com.sun.jersey.jersey-server - 1.17.0 | Instantiated the Application class org.opendaylight.aaa.idm.IdmLightApplication 2015-03-10 04:29:09,230 | INFO | Event Dispatcher | HttpServiceFactoryImpl | 90 - org.ops4j.pax.web.pax-web-runtime - 3.1.0 | Binding bundle: [org.opendaylight.aaa.authn-federation0.1.2.Helium-SR2 [129]] to http service 2015-03-10 04:29:19,985 | INFO | Event Dispatcher | HttpServiceFactoryImpl | 90 - org.ops4j.pax.web.pax-web-runtime - 3.1.0 | Binding bundle: [org.opendaylight.controller.sal-rest-connector1.1.2.Helium-SR2 [222]] to http service 2015-03-10 04:29:20,036 | INFO | pool-15-thread-3 | WebApplicationImpl | 107 - com.sun.jersey.jersey-server - 1.17.0 | Initiating Jersey application, version 'Jersey: 1.17 01/17/2013 03:31 PM' 2015-03-10 04:29:20,062 | INFO | pool-15-thread-3 | DeferredResourceConfig | 107 - com.sun.jersey.jersey-server - 1.17.0 | Instantiated the Application class org.opendaylight.controller.sal.rest.impl.RestconfApplication 2015-03-10 04:29:20,890 | WARN | pool-15-thread-3 | Errors | 106 - com.sun.jersey.core - 1.17.0 | The following warnings have been detected with resource and/or provider classes: WARNING: Parameter 2 of type org.opendaylight.yangtools.yang.data.api.Node from public abstract javax.ws.rs.core.Response org.opendaylight.controller.sal.rest.api.RestconfService.updateConfigurationData(java.lang.String,org.opendaylight.yangtools.yang.data.api.Node) is not resolvable to a concrete type WARNING: Parameter 1 of type org.opendaylight.yangtools.yang.data.api.Node from public abstract javax.ws.rs.core.Response org.opendaylight.controller.sal.rest.api.RestconfService.createConfigurationData(org.opendaylight.yangtools.yang.data.api.Node) is not resolvable to a concrete type WARNING: Parameter 2 of type org.opendaylight.yangtools.yang.data.api.Node from public abstract javax.ws.rs.core.Response org.opendaylight.controller.sal.rest.api.RestconfService.createConfigurationData(java.lang.String,org.opendaylight.yangtools.yang.data.api.Node) is not resolvable to a concrete type 2015-03-10 04:29:50,373 | INFO | Event Dispatcher | HttpServiceFactoryImpl | 90 - org.ops4j.pax.web.pax-web-runtime - 3.1.0 | Binding bundle: [org.opendaylight.controller.sal-rest-docgen1.1.2.Helium-SR2 [253]] to http service 2015-03-10 04:29:50,398 | INFO | Event Dispatcher | HttpServiceFactoryImpl | 90 - org.ops4j.pax.web.pax-web-runtime - 3.1.0 | Binding bundle: [org.opendaylight.dlux.web0.1.2.Helium-SR2 [261]] to http service 2015-03-10 04:29:50,731 | ERROR | pool-15-thread-2 | RegisterWebAppVisitorWC | 96 - org.ops4j.pax.web.pax-web-extender-war - 3.1.0 | Registration exception. Skipping java.lang.IllegalArgumentException: Security Mapping [free access] is already registered. at org.ops4j.pax.web.service.spi.model.ServiceModel.addSecurityConstraintMappingModel(ServiceModel.java:330)[89:org.ops4j.pax.web.pax-web-spi:3.1.0] at org.ops4j.pax.web.service.internal.HttpServiceStarted.registerConstraintMapping(HttpServiceStarted.java:929)[90:org.ops4j.pax.web.pax-web-runtime:3.1.0] at org.ops4j.pax.web.service.internal.HttpServiceProxy.registerConstraintMapping(HttpServiceProxy.java:356)[90:org.ops4j.pax.web.pax-web-runtime:3.1.0] at org.ops4j.pax.web.extender.war.internal.RegisterWebAppVisitorWC.visit(RegisterWebAppVisitorWC.java:329)[96:org.ops4j.pax.web.pax-web-extender-war:3.1.0] at org.ops4j.pax.web.extender.war.internal.model.WebApp.accept(WebApp.java:669)[96:org.ops4j.pax.web.pax-web-extender-war:3.1.0] at org.ops4j.pax.web.extender.war.internal.WebAppPublisher$WebAppDependencyListener.register(WebAppPublisher.java:237)[96:org.ops4j.pax.web.pax-web-extender-war:3.1.0] at org.ops4j.pax.web.extender.war.internal.WebAppPublisher$WebAppDependencyListener.addingService(WebAppPublisher.java:182)[96:org.ops4j.pax.web.pax-web-extender-war:3.1.0] at org.ops4j.pax.web.extender.war.internal.WebAppPublisher$WebAppDependencyListener.addingService(WebAppPublisher.java:135)[96:org.ops4j.pax.web.pax-web-extender-war:3.1.0] at org.osgi.util.tracker.ServiceTracker$Tracked.customizerAdding(ServiceTracker.java:932)[karaf-org.osgi.core.jar:] at org.osgi.util.tracker.ServiceTracker$Tracked.customizerAdding(ServiceTracker.java:864)[karaf-org.osgi.core.jar:] at org.osgi.util.tracker.AbstractTracked.trackAdding(AbstractTracked.java:256)[karaf-org.osgi.core.jar:] at org.osgi.util.tracker.AbstractTracked.trackInitial(AbstractTracked.java:183)[karaf-org.osgi.core.jar:] at org.osgi.util.tracker.ServiceTracker.open(ServiceTracker.java:317)[karaf-org.osgi.core.jar:] at org.osgi.util.tracker.ServiceTracker.open(ServiceTracker.java:261)[karaf-org.osgi.core.jar:] at org.ops4j.pax.web.extender.war.internal.WebAppPublisher.publish(WebAppPublisher.java:101)[96:org.ops4j.pax.web.pax-web-extender-war:3.1.0] at org.ops4j.pax.web.extender.war.internal.WebObserver.deploy(WebObserver.java:213)[96:org.ops4j.pax.web.pax-web-extender-war:3.1.0] at org.ops4j.pax.web.extender.war.internal.WebObserver$1.doStart(WebObserver.java:175)[96:org.ops4j.pax.web.pax-web-extender-war:3.1.0] at org.ops4j.pax.web.extender.war.internal.extender.SimpleExtension.start(SimpleExtension.java:58)[96:org.ops4j.pax.web.pax-web-extender-war:3.1.0] at org.ops4j.pax.web.extender.war.internal.extender.AbstractExtender$1.run(AbstractExtender.java:266)[96:org.ops4j.pax.web.pax-web-extender-war:3.1.0] at java.util.concurrent.Executors$RunnableAdapter.call(Executors.java:471)[:1.7.075] at java.util.concurrent.FutureTask.run(FutureTask.java:262)[:1.7.075] at java.util.concurrent.ScheduledThreadPoolExecutor$ScheduledFutureTask.access$201(ScheduledThreadPoolExecutor.java:178)[:1.7.075] at java.util.concurrent.ScheduledThreadPoolExecutor$ScheduledFutureTask.run(ScheduledThreadPoolExecutor.java:292)[:1.7.075] at java.util.concurrent.ThreadPoolExecutor.runWorker(ThreadPoolExecutor.java:1145)[:1.7.075] at java.util.concurrent.ThreadPoolExecutor$Worker.run(ThreadPoolExecutor.java:615)[:1.7.075] at java.lang.Thread.run(Thread.java:745)[:1.7.075] 2015-03-10 04:29:50,732 | ERROR | pool-15-thread-2 | RegisterWebAppVisitorWC | 96 - org.ops4j.pax.web.pax-web-extender-war - 3.1.0 | Registration exception. Skipping java.lang.IllegalArgumentException: Security Mapping [free access] is already registered. at org.ops4j.pax.web.service.spi.model.ServiceModel.addSecurityConstraintMappingModel(ServiceModel.java:330)[89:org.ops4j.pax.web.pax-web-spi:3.1.0] at org.ops4j.pax.web.service.internal.HttpServiceStarted.registerConstraintMapping(HttpServiceStarted.java:929)[90:org.ops4j.pax.web.pax-web-runtime:3.1.0] at org.ops4j.pax.web.service.internal.HttpServiceProxy.registerConstraintMapping(HttpServiceProxy.java:356)[90:org.ops4j.pax.web.pax-web-runtime:3.1.0] at org.ops4j.pax.web.extender.war.internal.RegisterWebAppVisitorWC.visit(RegisterWebAppVisitorWC.java:329)[96:org.ops4j.pax.web.pax-web-extender-war:3.1.0] at org.ops4j.pax.web.extender.war.internal.model.WebApp.accept(WebApp.java:669)[96:org.ops4j.pax.web.pax-web-extender-war:3.1.0] at org.ops4j.pax.web.extender.war.internal.WebAppPublisher$WebAppDependencyListener.register(WebAppPublisher.java:237)[96:org.ops4j.pax.web.pax-web-extender-war:3.1.0] at org.ops4j.pax.web.extender.war.internal.WebAppPublisher$WebAppDependencyListener.addingService(WebAppPublisher.java:182)[96:org.ops4j.pax.web.pax-web-extender-war:3.1.0] at org.ops4j.pax.web.extender.war.internal.WebAppPublisher$WebAppDependencyListener.addingService(WebAppPublisher.java:135)[96:org.ops4j.pax.web.pax-web-extender-war:3.1.0] at org.osgi.util.tracker.ServiceTracker$Tracked.customizerAdding(ServiceTracker.java:932)[karaf-org.osgi.core.jar:] at org.osgi.util.tracker.ServiceTracker$Tracked.customizerAdding(ServiceTracker.java:864)[karaf-org.osgi.core.jar:] at org.osgi.util.tracker.AbstractTracked.trackAdding(AbstractTracked.java:256)[karaf-org.osgi.core.jar:] at org.osgi.util.tracker.AbstractTracked.trackInitial(AbstractTracked.java:183)[karaf-org.osgi.core.jar:] at org.osgi.util.tracker.ServiceTracker.open(ServiceTracker.java:317)[karaf-org.osgi.core.jar:] at org.osgi.util.tracker.ServiceTracker.open(ServiceTracker.java:261)[karaf-org.osgi.core.jar:] at org.ops4j.pax.web.extender.war.internal.WebAppPublisher.publish(WebAppPublisher.java:101)[96:org.ops4j.pax.web.pax-web-extender-war:3.1.0] at org.ops4j.pax.web.extender.war.internal.WebObserver.deploy(WebObserver.java:213)[96:org.ops4j.pax.web.pax-web-extender-war:3.1.0] at org.ops4j.pax.web.extender.war.internal.WebObserver$1.doStart(WebObserver.java:175)[96:org.ops4j.pax.web.pax-web-extender-war:3.1.0] at org.ops4j.pax.web.extender.war.internal.extender.SimpleExtension.start(SimpleExtension.java:58)[96:org.ops4j.pax.web.pax-web-extender-war:3.1.0] at org.ops4j.pax.web.extender.war.internal.extender.AbstractExtender$1.run(AbstractExtender.java:266)[96:org.ops4j.pax.web.pax-web-extender-war:3.1.0] at java.util.concurrent.Executors$RunnableAdapter.call(Executors.java:471)[:1.7.075] at java.util.concurrent.FutureTask.run(FutureTask.java:262)[:1.7.075] at java.util.concurrent.ScheduledThreadPoolExecutor$ScheduledFutureTask.access$201(ScheduledThreadPoolExecutor.java:178)[:1.7.075] at java.util.concurrent.ScheduledThreadPoolExecutor$ScheduledFutureTask.run(ScheduledThreadPoolExecutor.java:292)[:1.7.075] at java.util.concurrent.ThreadPoolExecutor.runWorker(ThreadPoolExecutor.java:1145)[:1.7.075] at java.util.concurrent.ThreadPoolExecutor$Worker.run(ThreadPoolExecutor.java:615)[:1.7.075] at java.lang.Thread.run(Thread.java:745)[:1.7.075] 2015-03-10 04:29:50,733 | ERROR | pool-15-thread-2 | RegisterWebAppVisitorWC | 96 - org.ops4j.pax.web.pax-web-extender-war - 3.1.0 | Registration exception. Skipping java.lang.IllegalArgumentException: Security Mapping [free access] is already registered. at org.ops4j.pax.web.service.spi.model.ServiceModel.addSecurityConstraintMappingModel(ServiceModel.java:330)[89:org.ops4j.pax.web.pax-web-spi:3.1.0] at org.ops4j.pax.web.service.internal.HttpServiceStarted.registerConstraintMapping(HttpServiceStarted.java:929)[90:org.ops4j.pax.web.pax-web-runtime:3.1.0] at org.ops4j.pax.web.service.internal.HttpServiceProxy.registerConstraintMapping(HttpServiceProxy.java:356)[90:org.ops4j.pax.web.pax-web-runtime:3.1.0] at org.ops4j.pax.web.extender.war.internal.RegisterWebAppVisitorWC.visit(RegisterWebAppVisitorWC.java:329)[96:org.ops4j.pax.web.pax-web-extender-war:3.1.0] at org.ops4j.pax.web.extender.war.internal.model.WebApp.accept(WebApp.java:669)[96:org.ops4j.pax.web.pax-web-extender-war:3.1.0] at org.ops4j.pax.web.extender.war.internal.WebAppPublisher$WebAppDependencyListener.register(WebAppPublisher.java:237)[96:org.ops4j.pax.web.pax-web-extender-war:3.1.0] at org.ops4j.pax.web.extender.war.internal.WebAppPublisher$WebAppDependencyListener.addingService(WebAppPublisher.java:182)[96:org.ops4j.pax.web.pax-web-extender-war:3.1.0] at org.ops4j.pax.web.extender.war.internal.WebAppPublisher$WebAppDependencyListener.addingService(WebAppPublisher.java:135)[96:org.ops4j.pax.web.pax-web-extender-war:3.1.0] at org.osgi.util.tracker.ServiceTracker$Tracked.customizerAdding(ServiceTracker.java:932)[karaf-org.osgi.core.jar:] at org.osgi.util.tracker.ServiceTracker$Tracked.customizerAdding(ServiceTracker.java:864)[karaf-org.osgi.core.jar:] at org.osgi.util.tracker.AbstractTracked.trackAdding(AbstractTracked.java:256)[karaf-org.osgi.core.jar:] at org.osgi.util.tracker.AbstractTracked.trackInitial(AbstractTracked.java:183)[karaf-org.osgi.core.jar:] at org.osgi.util.tracker.ServiceTracker.open(ServiceTracker.java:317)[karaf-org.osgi.core.jar:] at org.osgi.util.tracker.ServiceTracker.open(ServiceTracker.java:261)[karaf-org.osgi.core.jar:] at org.ops4j.pax.web.extender.war.internal.WebAppPublisher.publish(WebAppPublisher.java:101)[96:org.ops4j.pax.web.pax-web-extender-war:3.1.0] at org.ops4j.pax.web.extender.war.internal.WebObserver.deploy(WebObserver.java:213)[96:org.ops4j.pax.web.pax-web-extender-war:3.1.0] at org.ops4j.pax.web.extender.war.internal.WebObserver$1.doStart(WebObserver.java:175)[96:org.ops4j.pax.web.pax-web-extender-war:3.1.0] at org.ops4j.pax.web.extender.war.internal.extender.SimpleExtension.start(SimpleExtension.java:58)[96:org.ops4j.pax.web.pax-web-extender-war:3.1.0] at org.ops4j.pax.web.extender.war.internal.extender.AbstractExtender$1.run(AbstractExtender.java:266)[96:org.ops4j.pax.web.pax-web-extender-war:3.1.0] at java.util.concurrent.Executors$RunnableAdapter.call(Executors.java:471)[:1.7.075] at java.util.concurrent.FutureTask.run(FutureTask.java:262)[:1.7.075] at java.util.concurrent.ScheduledThreadPoolExecutor$ScheduledFutureTask.access$201(ScheduledThreadPoolExecutor.java:178)[:1.7.075] at java.util.concurrent.ScheduledThreadPoolExecutor$ScheduledFutureTask.run(ScheduledThreadPoolExecutor.java:292)[:1.7.075] at java.util.concurrent.ThreadPoolExecutor.runWorker(ThreadPoolExecutor.java:1145)[:1.7.075] at java.util.concurrent.ThreadPoolExecutor$Worker.run(ThreadPoolExecutor.java:615)[:1.7.075] at java.lang.Thread.run(Thread.java:745)[:1.7.075] 2015-03-10 04:29:50,755 | INFO | pool-15-thread-2 | WebApplicationImpl | 107 - com.sun.jersey.jersey-server - 1.17.0 | Initiating Jersey application, version 'Jersey: 1.17 01/17/2013 03:31 PM' 2015-03-10 04:29:50,887 | INFO | pool-15-thread-2 | DeferredResourceConfig | 107 - com.sun.jersey.jersey-server - 1.17.0 | Instantiated the Application class org.opendaylight.controller.sal.rest.doc.jaxrs.ApiDocApplication 2015-03-10 04:29:52,682 | INFO | config-pusher | InMemoryDataTree | 151 - org.opendaylight.yangtools.yang-data-impl - 0.6.4.Helium-SR2 | Attempting to install schema contexts 2015-03-10 04:29:52,691 | INFO | config-pusher | ThreadExecutorStatsMXBeanImpl | 163 - org.opendaylight.controller.sal-common-util - 1.1.2.Helium-SR2 | Executor com.google.common.util.concurrent.MoreExecutors$SameThreadExecutorService@304be746 is not supported 2015-03-10 04:29:52,691 | INFO | config-pusher | InMemoryDataTree | 151 - org.opendaylight.yangtools.yang-data-impl - 0.6.4.Helium-SR2 | Attempting to install schema contexts 2015-03-10 04:29:52,692 | INFO | config-pusher | ThreadExecutorStatsMXBeanImpl | 163 - org.opendaylight.controller.sal-common-util - 1.1.2.Helium-SR2 | Executor com.google.common.util.concurrent.MoreExecutors$SameThreadExecutorService@71efee33 is not supported 2015-03-10 04:29:52,926 | INFO | config-pusher | dedBackwardsCompatibleDataBroker | 217 - org.opendaylight.controller.sal-binding-broker-impl - 1.1.2.Helium-SR2 | ForwardedBackwardsCompatibleBroker started. 2015-03-10 04:29:52,948 | INFO | config-pusher | RootBindingAwareBroker | 217 - org.opendaylight.controller.sal-binding-broker-impl - 1.1.2.Helium-SR2 | Starting Binding Aware Broker: binding-broker-impl 2015-03-10 04:29:53,020 | INFO | pool-23-thread-4 | FRMActivator | 243 - org.opendaylight.controller.md.forwardingrules-manager - 1.1.2.Helium-SR2 | FRMActivator initialization. 2015-03-10 04:29:53,147 | INFO | config-pusher | SwitchConnectionProviderModule | 231 - org.opendaylight.openflowjava.openflow-protocol-impl - 0.5.2.Helium-SR2 | SwitchConnectionProvider started. 2015-03-10 04:29:53,168 | INFO | pool-23-thread-3 | LLDPDiscoveryProvider | 240 - org.opendaylight.controller.md.topology-lldp-discovery - 1.1.2.Helium-SR2 | LLDPDiscoveryListener Started. 2015-03-10 04:29:53,191 | INFO | pool-23-thread-2 | FlowCapableInventoryProvider | 242 - org.opendaylight.controller.md.inventory-manager - 1.1.2.Helium-SR2 | Flow Capable Inventory Provider started. 2015-03-10 04:29:53,289 | INFO | pool-23-thread-4 | ForwardingRulesManagerImpl | 243 - org.opendaylight.controller.md.forwardingrules-manager - 1.1.2.Helium-SR2 | ForwardingRulesManager has started successfull. 2015-03-10 04:29:53,289 | INFO | pool-23-thread-4 | FRMActivator | 243 - org.opendaylight.controller.md.forwardingrules-manager - 1.1.2.Helium-SR2 | FRMActivator initialization successfull. 2015-03-10 04:29:53,306 | INFO | config-pusher | SwitchConnectionProviderModule | 231 - org.opendaylight.openflowjava.openflow-protocol-impl - 0.5.2.Helium-SR2 | SwitchConnectionProvider started. 2015-03-10 04:29:53,431 | INFO | Thread-36 | TcpHandler | 231 - org.opendaylight.openflowjava.openflow-protocol-impl - 0.5.2.Helium-SR2 | Switch listener started and ready to accept incoming tcp/tls connections on port: 6653 2015-03-10 04:29:53,431 | INFO | Thread-35 | TcpHandler | 231 - org.opendaylight.openflowjava.openflow-protocol-impl - 0.5.2.Helium-SR2 | Switch listener started and ready to accept incoming tcp/tls connections on port: 6633 2015-03-10 04:29:53,472 | INFO | config-pusher | MsgSpyServiceModule | 233 - org.opendaylight.openflowplugin - 0.0.5.Helium-SR2 | MsgStatService (instance org.opendaylight.yang.gen.v1.urn.opendaylight.params.xml.ns.yang.openflow.common.config.impl.rev140326.MsgSpyServiceModule$1AutoClosableMsgSpyService@1a1cec20) initialized. 2015-03-10 04:29:53,577 | INFO | config-pusher | PacketHandlerModule | 238 - org.opendaylight.l2switch.packethandler.impl - 0.1.2.Helium-SR2 | PacketHandler (instance org.opendaylight.yang.gen.v1.urn.opendaylight.packet.packet.handler.impl.rev140528.PacketHandlerModule$1CloseResources@446bba9e) initialized. 2015-03-10 04:29:53,650 | INFO | config-pusher | StatisticsManagerModule | 241 - org.opendaylight.controller.md.statistics-manager - 1.1.2.Helium-SR2 | StatisticsManager module initialization. 2015-03-10 04:29:53,746 | INFO | config-pusher | StatisticsManagerImpl | 241 - org.opendaylight.controller.md.statistics-manager - 1.1.2.Helium-SR2 | Statistics Manager started successfully! 2015-03-10 04:29:53,746 | INFO | config-pusher | StatisticsManagerModule | 241 - org.opendaylight.controller.md.statistics-manager - 1.1.2.Helium-SR2 | StatisticsManager started successfully. 2015-03-10 04:29:53,905 | INFO | config-pusher | LoopRemoverModule | 245 - org.opendaylight.l2switch.loopremover.impl - 0.1.2.Helium-SR2 | LoopRemover will install an lldp flow 2015-03-10 04:29:53,918 | INFO | config-pusher | LoopRemoverModule | 245 - org.opendaylight.l2switch.loopremover.impl - 0.1.2.Helium-SR2 | LoopRemover (instance org.opendaylight.yang.gen.v1.urn.opendaylight.packet.loop.remover.impl.rev140528.LoopRemoverModule$1CloseResources@1b653418) initialized. 2015-03-10 04:29:54,016 | INFO | config-pusher | ArpHandlerModule | 248 - org.opendaylight.l2switch.arphandler.impl - 0.1.2.Helium-SR2 | ArpHandler is in Proactive Flood Mode 2015-03-10 04:29:54,025 | INFO | config-pusher | ArpHandlerModule | 248 - org.opendaylight.l2switch.arphandler.impl - 0.1.2.Helium-SR2 | ArpHandler (instance org.opendaylight.yang.gen.v1.urn.opendaylight.packet.arp.handler.impl.rev140528.ArpHandlerModule$1CloseResources@7c036290) initialized. 2015-03-10 04:29:54,133 | INFO | config-pusher | AddressTrackerModule | 249 - org.opendaylight.l2switch.addresstracker.impl - 0.1.2.Helium-SR2 | AddressTracker (instance org.opendaylight.yang.gen.v1.urn.opendaylight.packet.address.tracker.impl.rev140528.AddressTrackerModule$1CloseResources@4533c3e0) initialized. 2015-03-10 04:29:54,226 | INFO | config-pusher | HostTrackerModule | 251 - org.opendaylight.l2switch.hosttracker.impl - 0.1.2.Helium-SR2 | HostTracker (instance org.opendaylight.yang.gen.v1.urn.opendaylight.l2switch.host.tracker.impl.rev140528.HostTrackerModule$1CloseResources@7abe4af7) initialized. 2015-03-10 04:29:56,416 | INFO | er [_value=8185] | WebSocketServer | 222 - org.opendaylight.controller.sal-rest-connector - 1.1.2.Helium-SR2 | Web socket server started at port 8185. 2015-03-10 04:29:58,798 | INFO | config-pusher | L2SwitchMainModule | 252 - org.opendaylight.l2switch.main.impl - 0.1.2.Helium-SR2 | L2Switch will install a dropall flow on each switch 2015-03-10 04:29:58,802 | INFO | config-pusher | L2SwitchMainModule | 252 - org.opendaylight.l2switch.main.impl - 0.1.2.Helium-SR2 | L2Switch will react to network traffic and install flows 2015-03-10 04:29:58,806 | INFO | config-pusher | L2SwitchMainModule | 252 - org.opendaylight.l2switch.main.impl - 0.1.2.Helium-SR2 | L2SwitchMain (instance org.opendaylight.yang.gen.v1.urn.opendaylight.l2switch.main.impl.rev140528.L2SwitchMainModule$1CloseResources@9696ca7) initialized.

"when try to create the network in the OpenStack the log error as below" Error: createnetworkpostcommit failed

q-svc.log 2015-03-10 05:21:21.391 5609 INFO neutron.wsgi [-] (5609) accepted ('192.168.15.193', 52471) 2015-03-10 05:21:21.392 5609 DEBUG keystonemiddleware.authtoken [-] Removing headers from request environment: X-Service-Catalog,X-Identity-Status,X-Roles,X-Service-Roles,X-Domain-Name,X-Service-Domain-Name,X-Project-Id,X-Service-Project-Id,X-Project-Domain-Name,X-Service-Project-Domain-Name,X-User-Id,X-Service-User-Id,X-User-Name,X-Service-User-Name,X-Project-Name,X-Service-Project-Name,X-User-Domain-Id,X-Service-User-Domain-Id,X-Domain-Id,X-Service-Domain-Id,X-User-Domain-Name,X-Service-User-Domain-Name,X-Project-Domain-Id,X-Service-Project-Domain-Id,X-Role,X-User,X-Tenant-Name,X-Tenant-Id,X-Tenant _removeauthheaders /usr/local/lib/python2.7/dist-packages/keystonemiddleware/authtoken.py:860 2015-03-10 05:21:21.392 5609 DEBUG keystonemiddleware.authtoken [-] Authenticating user token call /usr/local/lib/python2.7/dist-packages/keystonemiddleware/authtoken.py:782 2015-03-10 05:21:21.393 5609 DEBUG keystoneclient.session [-] REQ: curl -g -i --cacert "/opt/stack/data/ca-bundle.pem" -X GET http://192.168.15.193:35357/v3/auth/tokens -H "X-Subject-Token: {SHA1}288e3d9ee252fecec3310a9d168b9c44e26df4e9" -H "User-Agent: python-keystoneclient" -H "Accept: application/json" -H "X-Auth-Token: {SHA1}878b06d5fd2a8e3c244348182b117378a7e29291" httplogrequest /usr/local/lib/python2.7/dist-packages/keystoneclient/session.py:190 2015-03-10 05:21:21.394 5609 INFO urllib3.connectionpool [-] Resetting dropped connection: 192.168.15.193 2015-03-10 05:21:21.395 5609 DEBUG urllib3.connectionpool [-] Setting read timeout to None _makerequest /usr/lib/python2.7/dist-packages/urllib3/connectionpool.py:390 2015-03-10 05:21:21.464 5609 DEBUG urllib3.connectionpool [-] "GET /v3/auth/tokens HTTP/1.1" 200 4675 makerequest /usr/lib/python2.7/dist-packages/urllib3/connectionpool.py:430 2015-03-10 05:21:21.465 5609 DEBUG keystoneclient.session [-] RESP: [200] content-length: 4675 x-subject-token: {SHA1}288e3d9ee252fecec3310a9d168b9c44e26df4e9 vary: X-Auth-Token server: Apache/2.4.7 (Ubuntu) date: Tue, 10 Mar 2015 12:21:21 GMT content-type: application/json RESP BODY: {"token": {"methods": ["password", "token"], "roles": [{"id": "1bb29ad9cda04aa49f293dada7067442", "name": "admin"}], "expiresat": "2015-03-10T13:21:21.000000Z", "project": {"domain": {"id": "default", "name": "Default"}, "id": "8a2ca39843074af09b334acae8d93a79", "name": "demo"}, "catalog": "<removed>", "extras": {}, "user": {"domain": {"id": "default", "name": "Default"}, "id": "f6c86a7d90dc4e7da1188e8fa8ee8a90", "name": "admin"}, "auditids": ["FsKhyF7KQE-LzsDb3FhyA"], "issuedat": "2015-03-10T12:21:21.375160"}} httplogresponse /usr/local/lib/python2.7/dist-packages/keystoneclient/session.py:218 2015-03-10 05:21:21.466 5609 DEBUG keystonemiddleware.authtoken [-] Storing token in cache store /usr/local/lib/python2.7/dist-packages/keystonemiddleware/authtoken.py:1773 2015-03-10 05:21:21.466 5609 DEBUG keystonemiddleware.authtoken [-] Authenticating service token call /usr/local/lib/python2.7/dist-packages/keystonemiddleware/authtoken.py:803 2015-03-10 05:21:21.466 5609 DEBUG keystonemiddleware.authtoken [-] Received request from user: userid None, projectid None, roles None service: userid None, projectid None, roles None call /usr/local/lib/python2.7/dist-packages/keystonemiddleware/authtoken.py:821 2015-03-10 05:21:21.467 5609 DEBUG routes.middleware [req-e7078c1e-7d8d-4ef3-9c9d-2e1ac87928c6 ] No route matched for POST /networks.json call /usr/local/lib/python2.7/dist-packages/routes/middleware.py:101 2015-03-10 05:21:21.467 5609 DEBUG routes.middleware [req-e7078c1e-7d8d-4ef3-9c9d-2e1ac87928c6 ] Matched POST /networks.json call /usr/local/lib/python2.7/dist-packages/routes/middleware.py:105 2015-03-10 05:21:21.467 5609 DEBUG routes.middleware [req-e7078c1e-7d8d-4ef3-9c9d-2e1ac87928c6 ] Route path: '/networks{.format}', defaults: {'action': u'create', 'controller': <wsgify at="" 140615044906896="" wrapping="" <function="" resource="" at="" 0x7fe37dc20230="">>} call /usr/local/lib/python2.7/dist-packages/routes/middleware.py:107 2015-03-10 05:21:21.468 5609 DEBUG routes.middleware [req-e7078c1e-7d8d-4ef3-9c9d-2e1ac87928c6 ] Match dict: {'action': u'create', 'controller' : <wsgify at="" 140615044906896="" wrapping="" <function="" resource="" at="" 0x7fe37dc20230="">>, 'format': u'json'} call /usr/local/lib/python2.7/dist-packages/routes/middleware.py:108 2015-03-10 05:21:21.468 5609 DEBUG neutron.api.v2.base [req-e7078c1e-7d8d-4ef3-9c9d-2e1ac87928c6 None] Request body: {u'network': {u'name': u'private', u'adminstateup': True}} preparerequestbody /opt/stack/neutron/neutron/api/v2/base.py:582 2015-03-10 05:21:21.469 5609 DEBUG neutron.policy [req-e7078c1e-7d8d-4ef3-9c9d-2e1ac87928c6 None] Enforcing rules: ['createnetwork'] buildmatchrule /opt/stack/neutron/neutron/policy.py:221 2015-03-10 05:21:21.488 5609 DEBUG neutron.plugins.ml2.drivers.helpers [req-e7078c1e-7d8d-4ef3-9c9d-2e1ac87928c6 None] vxlan segment allocate from pool, attempt 1 started with {'vxlanvni': 1001L} allocatepartiallyspecifiedsegment /opt/stack/neutron/neutron/plugins/ml2/drivers/helpers.py:122 2015-03-10 05:21:21.490 5609 DEBUG neutron.plugins.ml2.drivers.helpers [req-e7078c1e-7d8d-4ef3-9c9d-2e1ac87928c6 None] vxlan segment allocate from pool, attempt 1 success with {'vxlanvni': 1001L} allocatepartiallyspecifiedsegment /opt/stack/neutron/neutron/plugins/ml2/drivers/helpers.py:130 2015-03-10 05:21:21.493 5609 INFO neutron.plugins.ml2.db [req-e7078c1e-7d8d-4ef3-9c9d-2e1ac87928c6 None] Added segment 80e1767f-b704-4360-b003-1bb26f796600 of type vxlan for network 53d77b2c-9bb2-487a-96f2-bb3aba55dfd2 2015-03-10 05:21:21.504 5609 DEBUG neutron.openstack.common.lockutils [req-e7078c1e-7d8d-4ef3-9c9d-2e1ac87928c6 None] Got semaphore "odl-sync-full" lock /opt/stack/neutron/neutron/openstack/common/lockutils.py:168 2015-03-10 05:21:21.505 5609 DEBUG neutron.openstack.common.lockutils [req-e7078c1e-7d8d-4ef3-9c9d-2e1ac87928c6 None] Got semaphore / lock "syncfull" inner /opt/stack/neutron/neutron/openstack/common/lockutils.py:248 2015-03-10 05:21:21.516 5609 DEBUG neutron.plugins.ml2.drivers.mechanismodl [req-e7078c1e-7d8d-4ef3-9c9d-2e1ac87928c6 None] Sending METHOD (get) URL (http://192.168.15.193:8181/controller/nb/v2/neutron/networks/53d77b2c-9bb2-487a-96f2-bb3aba55dfd2) JSON (None) sendjson /opt/stack/neutron/neutron/plugins/ml2/drivers/mechanismodl.py:241 2015-03-10 05:21:21.517 5609 INFO urllib3.connectionpool [req-e7078c1e-7d8d-4ef3-9c9d-2e1ac87928c6 ] Starting new HTTP connection (1): 192.168.15.193 2015-03-10 05:21:21.519 5609 DEBUG urllib3.connectionpool [req-e7078c1e-7d8d-4ef3-9c9d-2e1ac87928c6 ] Setting read timeout to 10 makerequest /usr/lib/python2.7/dist-packages/urllib3/connectionpool.py:390 2015-03-10 05:21:21.521 5609 DEBUG urllib3.connectionpool [req-e7078c1e-7d8d-4ef3-9c9d-2e1ac87928c6 ] "GET /controller/nb/v2/neutron/networks/53d77b2c-9bb2-487a-96f2-bb3aba55dfd2 HTTP/1.1" 404 1337 makerequest /usr/lib/python2.7/dist-packages/urllib3/connectionpool.py:430 2015-03-10 05:21:21.522 5609 DEBUG neutron.plugins.ml2.drivers.mechanismodl [req-e7078c1e-7d8d-4ef3-9c9d-2e1ac87928c6 None] Sending METHOD (post) URL (http://192.168.15.193:8181/controller/nb/v2/neutron/networks) JSON ({'network': [{'name': u'private', 'provider:physicalnetwork': None, 'adminstateup': True, 'tenantid': u'8a2ca39843074af09b334acae8d93a79', 'provider:networktype': u'vxlan', 'router:external': False, 'shared': False, 'id': u'53d77b2c-9bb2-487a-96f2-bb3aba55dfd2', 'provider:segmentationid': 1001L}]}) sendjson /opt/stack/neutron/neutron/plugins/ml2/drivers/mechanismodl.py:241 2015-03-10 05:21:21.525 5609 INFO urllib3.connectionpool [req-e7078c1e-7d8d-4ef3-9c9d-2e1ac87928c6 ] Starting new HTTP connection (1): 192.168.15.193 2015-03-10 05:21:21.527 5609 DEBUG urllib3.connectionpool [req-e7078c1e-7d8d-4ef3-9c9d-2e1ac87928c6 ] Setting read timeout to 10 makerequest /usr/lib/python2.7/dist-packages/urllib3/connectionpool.py:390 2015-03-10 05:21:21.532 5609 DEBUG urllib3.connectionpool [req-e7078c1e-7d8d-4ef3-9c9d-2e1ac87928c6 ] "POST /controller/nb/v2/neutron/networks HTTP/1.1" 404 1300 makerequest /usr/lib/python2.7/dist-packages/urllib3/connectionpool.py:430 2015-03-10 05:21:21.533 5609 DEBUG neutron.openstack.common.lockutils [req-e7078c1e-7d8d-4ef3-9c9d-2e1ac87928c6 None] Semaphore / lock released "syncfull" inner /opt/stack/neutron/neutron/openstack/common/lockutils.py:252 2015-03-10 05:21:21.533 5609 ERROR neutron.plugins.ml2.managers [req-e7078c1e-7d8d-4ef3-9c9d-2e1ac87928c6 None] Mechanism driver 'opendaylight' failed in createnetworkpostcommit 2015-03-10 05:21:21.533 5609 TRACE neutron.plugins.ml2.managers Traceback (most recent call last): 2015-03-10 05:21:21.533 5609 TRACE neutron.plugins.ml2.managers File "/opt/stack/neutron/neutron/plugins/ml2/managers.py", line 291, in _callondrivers 2015-03-10 05:21:21.533 5609 TRACE neutron.plugins.ml2.managers getattr(driver.obj, methodname)(context) 2015-03-10 05:21:21.533 5609 TRACE neutron.plugins.ml2.managers File "/opt/stack/neutron/neutron/plugins/ml2/drivers/mechanismodl.py", line 91, in createnetworkpostcommit 2015-03-10 05:21:21.533 5609 TRACE neutron.plugins.ml2.managers self.synchronize('create', ODLNETWORKS, context) 2015-03-10 05:21:21.533 5609 TRACE neutron.plugins.ml2.managers File "/opt/stack/neutron/neutron/plugins/ml2/drivers/mechanismodl.py", line 120, in synchronize 2015-03-10 05:21:21.533 5609 TRACE neutron.plugins.ml2.managers self.syncfull(context) 2015-03-10 05:21:21.533 5609 TRACE neutron.plugins.ml2.managers File "/opt/stack/neutron/neutron/openstack/common/lockutils.py", line 249, in inner 2015-03-10 05:21:21.533 5609 TRACE neutron.plugins.ml2.managers return f(args, *kwargs) 2015-03-10 05:21:21.533 5609 TRACE neutron.plugins.ml2.managers File "/opt/stack/neutron/neutron/plugins/ml2/drivers/mechanismodl.py", line 179, in syncfull 2015-03-10 05:21:21.533 5609 TRACE neutron.plugins.ml2.managers self.syncresources(collectionname, context) 2015-03-10 05:21:21.533 5609 TRACE neutron.plugins.ml2.managers File "/opt/stack/neutron/neutron/plugins/ml2/drivers/mechanismodl.py", line 167, in syncresources 2015-03-10 05:21:21.533 5609 TRACE neutron.plugins.ml2.managers self.sendjson('post', collectionname, {key: tobesynced}) 2015-03-10 05:21:21.533 5609 TRACE neutron.plugins.ml2.managers File "/opt/stack/neutron/neutron/plugins/ml2/drivers/mechanismodl.py", line 245, in sendjson 2015-03-10 05:21:21.533 5609 TRACE neutron.plugins.ml2.managers r.raiseforstatus() 2015-03-10 05:21:21.533 5609 TRACE neutron.plugins.ml2.managers File "/usr/lib/python2.7/dist-packages/requests/models.py", line 773, in raiseforstatus 2015-03-10 05:21:21.533 5609 TRACE neutron.plugins.ml2.managers raise HTTPError(httperrormsg, response=self) 2015-03-10 05:21:21.533 5609 TRACE neutron.plugins.ml2.managers HTTPError: 404 Client Error: Not Found 2015-03-10 05:21:21.533 5609 TRACE neutron.plugins.ml2.managers 2015-03-10 05:21:21.534 5609 ERROR neutron.plugins.ml2.plugin [req-e7078c1e-7d8d-4ef3-9c9d-2e1ac87928c6 None] mechanismmanager.createnetworkpostcommit failed, deleting network '53d77b2c-9bb2-487a-96f2-bb3aba55dfd2' 2015-03-10 05:21:21.535 5609 DEBUG neutron.plugins.ml2.plugin [req-e7078c1e-7d8d-4ef3-9c9d-2e1ac87928c6 None] Deleting network 53d77b2c-9bb2-487a-96f2-bb3aba55dfd2 deletenetwork /opt/stack/neutron/neutron/plugins/ml2/plugin.py:572 2015-03-10 05:21:21.540 5609 DEBUG neutron.openstack.common.lockutils [req-e7078c1e-7d8d-4ef3-9c9d-2e1ac87928c6 None] Got semaphore "db-access" lock /opt/stack/neutron/neutron/openstack/common/lockutils.py:168 2015-03-10 05:21:21.544 5609 DEBUG neutron.plugins.ml2.plugin [req-e7078c1e-7d8d-4ef3-9c9d-2e1ac87928c6 None] Ports to auto-delete: [] deletenetwork /opt/stack/neutron/neutron/plugins/ml2/plugin.py:599 2015-03-10 05:21:21.547 5609 DEBUG neutron.plugins.ml2.plugin [req-e7078c1e-7d8d-4ef3-9c9d-2e1ac87928c6 None] Subnets to auto-delete: [] deletenetwork /opt/stack/neutron/neutron/plugins/ml2/plugin.py:613 2015-03-10 05:21:21.566 5609 DEBUG neutron.plugins.ml2.drivers.typetunnel [req-e7078c1e-7d8d-4ef3-9c9d-2e1ac87928c6 None] Releasing vxlan tunnel 1001 to pool releasesegment /opt/stack/neutron/neutron/plugins/ml2/drivers/typetunnel.py:135 2015-03-10 05:21:21.573 5609 DEBUG neutron.plugins.ml2.plugin [req-e7078c1e-7d8d-4ef3-9c9d-2e1ac87928c6 None] Deleting network record <neutron.db.models_v2.network[object at="" 7fe37d8e3e90]="" {tenant_id="u'8a2ca39843074af09b334acae8d93a79'," id="u'53d77b2c-9bb2-487a-96f2-bb3aba55dfd2'," name="u'private'," status="u'ACTIVE'," admin_state_up="True," shared="False}&gt;" delete<="" em="">network /opt/stack/neutron/neutron/plugins/ml2/plugin.py:625 2015-03-10 05:21:21.574 5609 DEBUG neutron.plugins.ml2.plugin [req-e7078c1e-7d8d-4ef3-9c9d-2e1ac87928c6 None] Committing transaction deletenetwork /opt/stack/neutron/neutron/plugins/ml2/plugin.py:630 2015-03-10 05:21:21.588 5609 DEBUG neutron.openstack.common.lockutils [req-e7078c1e-7d8d-4ef3-9c9d-2e1ac87928c6 None] Got semaphore "odl-sync-full" lock /opt/stack/neutron/neutron/openstack/common/lockutils.py:168 2015-03-10 05:21:21.589 5609 DEBUG neutron.openstack.common.lockutils [req-e7078c1e-7d8d-4ef3-9c9d-2e1ac87928c6 None] Got semaphore / lock "syncfull" inner /opt/stack/neutron/neutron/openstack/common/lockutils.py:248 2015-03-10 05:21:21.599 5609 DEBUG neutron.plugins.ml2.drivers.mechanismodl [req-e7078c1e-7d8d-4ef3-9c9d-2e1ac87928c6 None] Sending METHOD (post) URL (http://192.168.15.193:8181/controller/nb/v2/neutron/networks) JSON ({'networks': []}) sendjson /opt/stack/neutron/neutron/plugins/ml2/drivers/mechanismodl.py:241 2015-03-10 05:21:21.601 5609 INFO urllib3.connectionpool [req-e7078c1e-7d8d-4ef3-9c9d-2e1ac87928c6 ] Starting new HTTP connection (1): 192.168.15.193 2015-03-10 05:21:21.602 5609 DEBUG urllib3.connectionpool [req-e7078c1e-7d8d-4ef3-9c9d-2e1ac87928c6 ] Setting read timeout to 10 makerequest /usr/lib/python2.7/dist-packages/urllib3/connectionpool.py:390 2015-03-10 05:21:21.603 5609 DEBUG urllib3.connectionpool [req-e7078c1e-7d8d-4ef3-9c9d-2e1ac87928c6 ] "POST /controller/nb/v2/neutron/networks HTTP/1.1" 404 1300 makerequest /usr/lib/python2.7/dist-packages/urllib3/connectionpool.py:430 2015-03-10 05:21:21.605 5609 DEBUG neutron.openstack.common.lockutils [req-e7078c1e-7d8d-4ef3-9c9d-2e1ac87928c6 None] Semaphore / lock released "syncfull" inner /opt/stack/neutron/neutron/openstack/common/lockutils.py:252 2015-03-10 05:21:21.606 5609 ERROR neutron.plugins.ml2.managers [req-e7078c1e-7d8d-4ef3-9c9d-2e1ac87928c6 None] Mechanism driver 'opendaylight' failed in deletenetworkpostcommit 2015-03-10 05:21:21.606 5609 TRACE neutron.plugins.ml2.managers Traceback (most recent call last): 2015-03-10 05:21:21.606 5609 TRACE neutron.plugins.ml2.managers File "/opt/stack/neutron/neutron/plugins/ml2/managers.py", line 291, in _callondrivers 2015-03-10 05:21:21.606 5609 TRACE neutron.plugins.ml2.managers getattr(driver.obj, methodname)(context) 2015-03-10 05:21:21.606 5609 TRACE neutron.plugins.ml2.managers File "/opt/stack/neutron/neutron/plugins/ml2/drivers/mechanismodl.py", line 97, in deletenetworkpostcommit 2015-03-10 05:21:21.606 5609 TRACE neutron.plugins.ml2.managers self.synchronize('delete', ODLNETWORKS, context) 2015-03-10 05:21:21.606 5609 TRACE neutron.plugins.ml2.managers File "/opt/stack/neutron/neutron/plugins/ml2/drivers/mechanismodl.py", line 120, in synchronize 2015-03-10 05:21:21.606 5609 TRACE neutron.plugins.ml2.managers self.syncfull(context) 2015-03-10 05:21:21.606 5609 TRACE neutron.plugins.ml2.managers File "/opt/stack/neutron/neutron/openstack/common/lockutils.py", line 249, in inner 2015-03-10 05:21:21.606 5609 TRACE neutron.plugins.ml2.managers return f(args, *kwargs) 2015-03-10 05:21:21.606 5609 TRACE neutron.plugins.ml2.managers File "/opt/stack/neutron/neutron/plugins/ml2/drivers/mechanismodl.py", line 179, in syncfull 2015-03-10 05:21:21.606 5609 TRACE neutron.plugins.ml2.managers self.syncresources(collectionname, context) 2015-03-10 05:21:21.606 5609 TRACE neutron.plugins.ml2.managers File "/opt/stack/neutron/neutron/plugins/ml2/drivers/mechanismodl.py", line 167, in syncresources 2015-03-10 05:21:21.606 5609 TRACE neutron.plugins.ml2.managers self.sendjson('post', collectionname, {key: tobesynced}) 2015-03-10 05:21:21.606 5609 TRACE neutron.plugins.ml2.managers File "/opt/stack/neutron/neutron/plugins/ml2/drivers/mechanismodl.py", line 245, in sendjson 2015-03-10 05:21:21.606 5609 TRACE neutron.plugins.ml2.managers r.raiseforstatus() 2015-03-10 05:21:21.606 5609 TRACE neutron.plugins.ml2.managers File "/usr/lib/python2.7/dist-packages/requests/models.py", line 773, in raiseforstatus 2015-03-10 05:21:21.606 5609 TRACE neutron.plugins.ml2.managers raise HTTPError(httperrormsg, response=self) 2015-03-10 05:21:21.606 5609 TRACE neutron.plugins.ml2.managers HTTPError: 404 Client Error: Not Found 2015-03-10 05:21:21.606 5609 TRACE neutron.plugins.ml2.managers 2015-03-10 05:21:21.607 5609 ERROR neutron.plugins.ml2.plugin [req-e7078c1e-7d8d-4ef3-9c9d-2e1ac87928c6 None] mechanismmanager.deletenetworkpostcommit failed 2015-03-10 05:21:21.608 5609 DEBUG neutron.common.rpc [req-e7078c1e-7d8d-4ef3-9c9d-2e1ac87928c6 None] neutron.plugins.ml2.rpc.AgentNotifierApi method fanoutcast called with arguments (<neutron.context.context object="" at="" 0x7fe37d9e6a50="">, {'args': {'networkid': '53d77b2c-9bb2-487a-96f2-bb3aba55dfd2'}, 'namespace': None, 'method': 'networkdelete'}) {'topic': 'q-agent-notifier-network-delete'} wrapper /opt/stack/neutron/neutron/common/log.py:33 2015-03-10 05:21:21.615 5609 ERROR neutron.api.v2.resource [req-e7078c1e-7d8d-4ef3-9c9d-2e1ac87928c6 None] create failed 2015-03-10 05:21:21.615 5609 TRACE neutron.api.v2.resource Traceback (most recent call last): 2015-03-10 05:21:21.615 5609 TRACE neutron.api.v2.resource File "/opt/stack/neutron/neutron/api/v2/resource.py", line 87, in resource 2015-03-10 05:21:21.615 5609 TRACE neutron.api.v2.resource result = method(request=request, *args) 2015-03-10 05:21:21.615 5609 TRACE neutron.api.v2.resource File "/opt/stack/neutron/neutron/api/v2/base.py", line 448, in create 2015-03-10 05:21:21.615 5609 TRACE neutron.api.v2.resource obj = obj_creator(request.context, *kwargs) 2015-03-10 05:21:21.615 5609 TRACE neutron.api.v2.resource File "/opt/stack/neutron/neutron/plugins/ml2/plugin.py", line 511, in createnetwork 2015-03-10 05:21:21.615 5609 TRACE neutron.api.v2.resource self.deletenetwork(context, result['id']) 2015-03-10 05:21:21.615 5609 TRACE neutron.api.v2.resource File "/opt/stack/neutron/neutron/openstack/common/excutils.py", line 82, in exit 2015-03-10 05:21:21.615 5609 TRACE neutron.api.v2.resource six.reraise(self.type, self.value, self.tb) 2015-03-10 05:21:21.615 5609 TRACE neutron.api.v2.resource File "/opt/stack/neutron/neutron/plugins/ml2/plugin.py", line 506, in createnetwork 2015-03-10 05:21:21.615 5609 TRACE neutron.api.v2.resource self.mechanismmanager.createnetworkpostcommit(mechcontext) 2015-03-10 05:21:21.615 5609 TRACE neutron.api.v2.resource File "/opt/stack/neutron/neutron/plugins/ml2/managers.py", line 330, in createnetworkpostcommit 2015-03-10 05:21:21.615 5609 TRACE neutron.api.v2.resource self.callondrivers("createnetworkpostcommit", context) 2015-03-10 05:21:21.615 5609 TRACE neutron.api.v2.resource File "/opt/stack/neutron/neutron/plugins/ml2/managers.py", line 302, in _callondrivers 2015-03-10 05:21:21.615 5609 TRACE neutron.api.v2.resource method=methodname 2015-03-10 05:21:21.615 5609 TRACE neutron.api.v2.resource MechanismDriverError: createnetworkpostcommit failed. 2015-03-10 05:21:21.615 5609 TRACE neutron.api.v2.resource 2015-03-10 05:21:21.617 5609 INFO neutron.wsgi [req-e7078c1e-7d8d-4ef3-9c9d-2e1ac87928c6 None] 192.168.15.193 - - [10/Mar/2015 05:21:21] "POST /v2.0/networks.json HTTP/1.1" 500 321 0.225750 2015-03-10 05:21:31.475 5609 DEBUG neutron.context [req-2c7fd1d7-3a36-4dc9-a645-fc25ead6a2dd None] Arguments dropped when creating context: {u'project_name': None, u'tenant': None} init /opt/stack/neutron/neutron/context.py:83

Please give me a fix. From one month i am trying the same to fix.