Ask is moving to Stack Overflow and Serverfault.com! Please use the "opendaylight" tag on either of these sites. This site is now in Read-Only mode

Revision history [back]

click to hide/show revision 1
initial version

Stable/Helium release of Controller supports Java 1.8.0_25 ?

I am using Java 1.8.0_25 to compile the controller, and that gave following error :

[INFO] [INFO] --- maven-enunciate-plugin:1.28:docs (default) @ connectionmanager.northbound --- [INFO] ------------------------------------------------------------------------ [INFO] Reactor Summary: [INFO] [INFO] checkstyle ......................................... SUCCESS [ 0.655 s] [INFO] commons.opendaylight ............................... SUCCESS [ 1.417 s] [INFO] sal ................................................ SUCCESS [ 11.604 s] [INFO] configuration ...................................... SUCCESS [ 1.302 s] [INFO] containermanager ................................... SUCCESS [ 0.975 s] [INFO] usermanager ........................................ SUCCESS [ 3.224 s] [INFO] appauth ............................................ SUCCESS [ 0.554 s] [INFO] clustering.services ................................ SUCCESS [ 0.691 s] [INFO] sal.connection ..................................... SUCCESS [ 0.544 s] [INFO] connectionmanager .................................. SUCCESS [ 0.477 s] [INFO] hosttracker ........................................ SUCCESS [ 0.649 s] [INFO] switchmanager ...................................... SUCCESS [ 1.454 s] [INFO] topologymanager .................................... SUCCESS [ 2.257 s] [INFO] arphandler ......................................... SUCCESS [ 1.157 s] [INFO] bundlescanner ...................................... SUCCESS [ 0.469 s] [INFO] bundlescanner.implementation ....................... SUCCESS [ 1.814 s] [INFO] commons.parent ..................................... SUCCESS [ 1.298 s] [INFO] commons.logbacksettings ........................... SUCCESS [ 0.139 s] [INFO] clustering.services-implementation ................. SUCCESS [ 6.752 s] [INFO] clustering.test .................................... SUCCESS [ 2.416 s] [INFO] commons.httpclient ................................. SUCCESS [ 1.840 s] [INFO] commons.northbound ................................. SUCCESS [ 9.480 s] [INFO] configuration.implementation ....................... SUCCESS [ 0.602 s] [INFO] connectionmanager.implementation ................... SUCCESS [ 0.614 s] [INFO] connectionmanager.northbound ....................... FAILURE [ 5.667 s] [INFO] containermanager.implementation .................... SKIPPED [INFO] web ................................................ SKIPPED [INFO] containermanager.northbound ........................ SKIPPED [INFO] controllermanager.northbound ....................... SKIPPED [INFO] forwarding.staticrouting ........................... SKIPPED [INFO] forwardingrulesmanager ............................. SKIPPED [INFO] devices.web ........................................ SKIPPED [INFO] flowprogrammer.northbound .......................... SKIPPED [INFO] flows.web .......................................... SKIPPED [INFO] forwarding.staticrouting.northbound ................ SKIPPED [INFO] forwardingrulesmanager.implementation .............. SKIPPED [INFO] hosttracker.implementation ......................... SKIPPED [INFO] hosttracker.northbound ............................. SKIPPED [INFO] httpservice-bridge ................................. SKIPPED [INFO] jolokia-bridge ..................................... SKIPPED [INFO] logging.bridge ..................................... SKIPPED [INFO] sal.networkconfiguration ........................... SKIPPED [INFO] networkconfig.bridgedomain.northbound .............. SKIPPED [INFO] networkconfig.neutron .............................. SKIPPED [INFO] networkconfig.neutron.implementation ............... SKIPPED [INFO] networkconfig.neutron.northbound ................... SKIPPED [INFO] osgi-brandfragment.web ............................. SKIPPED [INFO] protocolplugins.openflow .......................... SKIPPED [INFO] routing.dijkstraimplementation .................... SKIPPED [INFO] sal.connection.implementation ...................... SKIPPED [INFO] sal.implementation ................................. SKIPPED [INFO] sal.networkconfiguration.implementation ............ SKIPPED [INFO] samples.loadbalancer ............................... SKIPPED [INFO] samples.loadbalancer.northbound .................... SKIPPED [INFO] samples.simpleforwarding ........................... SKIPPED [INFO] security ........................................... SKIPPED [INFO] statisticsmanager .................................. SKIPPED [INFO] statistics.northbound .............................. SKIPPED [INFO] statisticsmanager.implementation ................... SKIPPED [INFO] subnets.northbound ................................. SKIPPED [INFO] switchmanager.implementation ....................... SKIPPED [INFO] switchmanager.northbound ........................... SKIPPED [INFO] topology.northbound ................................ SKIPPED [INFO] topology.web ....................................... SKIPPED [INFO] troubleshoot.web ................................... SKIPPED [INFO] usermanager.implementation ......................... SKIPPED [INFO] usermanager.northbound ............................. SKIPPED [INFO] netconf-subsystem .................................. SKIPPED [INFO] ietf-netconf-monitoring ............................ SKIPPED [INFO] ietf-netconf-monitoring-extension .................. SKIPPED [INFO] concepts ........................................... SKIPPED [INFO] config-subsystem ................................... SKIPPED [INFO] config-api ......................................... SKIPPED [INFO] config-util ........................................ SKIPPED [INFO] config-manager ..................................... SKIPPED [INFO] config-plugin-parent ............................... SKIPPED [INFO] yang-jmx-generator ................................. SKIPPED [INFO] yang-jmx-generator-plugin .......................... SKIPPED [INFO] netty-config-api ................................... SKIPPED [INFO] netty-event-executor-config ........................ SKIPPED [INFO] protocol-framework ................................. SKIPPED [INFO] netconf-api ........................................ SKIPPED [INFO] netconf-mapping-api ................................ SKIPPED [INFO] netconf-util ....................................... SKIPPED [INFO] commons.thirdparty ................................. SKIPPED [INFO] ganymed ............................................ SKIPPED [INFO] netconf-netty-util ................................. SKIPPED [INFO] netconf-client ..................................... SKIPPED [INFO] netconf-impl ....................................... SKIPPED [INFO] yang-test-plugin ................................... SKIPPED [INFO] yang-test .......................................... SKIPPED [INFO] config-netconf-connector ........................... SKIPPED [INFO] config-persister-api ............................... SKIPPED [INFO] config-persister-file-xml-adapter .................. SKIPPED [INFO] config-persister-directory-xml-adapter ............. SKIPPED [INFO] config-persister-impl .............................. SKIPPED [INFO] filter-valve ....................................... SKIPPED [INFO] logback-config ..................................... SKIPPED [INFO] netty-threadgroup-config ........................... SKIPPED [INFO] threadpool-config-api .............................. SKIPPED [INFO] threadpool-config-impl ............................. SKIPPED [INFO] netty-timer-config ................................. SKIPPED [INFO] netconf-config-dispatcher .......................... SKIPPED [INFO] netconf-monitoring ................................. SKIPPED [INFO] netconf-auth ....................................... SKIPPED [INFO] netconf-ssh ........................................ SKIPPED [INFO] netconf-usermanager ................................ SKIPPED [INFO] netconf-tcp ........................................ SKIPPED [INFO] sal-parent ......................................... SKIPPED [INFO] sal-common-api ..................................... SKIPPED [INFO] sal-binding-api .................................... SKIPPED [INFO] sal-binding-config ................................. SKIPPED [INFO] sal-binding-util ................................... SKIPPED [INFO] sal-common-util .................................... SKIPPED [INFO] sal-common-impl .................................... SKIPPED [INFO] sal-common ......................................... SKIPPED [INFO] sal-core-api ....................................... SKIPPED [INFO] sal-core-spi ....................................... SKIPPED [INFO] sal-test-model ..................................... SKIPPED [INFO] sal-inmemory-datastore ............................. SKIPPED [INFO] sal-broker-impl .................................... SKIPPED [INFO] model-parent ....................................... SKIPPED [INFO] model-inventory .................................... SKIPPED [INFO] model-flow-base .................................... SKIPPED [INFO] model-flow-service ................................. SKIPPED [INFO] model-flow-statistics .............................. SKIPPED [INFO] sal-binding-broker-impl ............................ SKIPPED [INFO] model-topology ..................................... SKIPPED [INFO] MD-SAL to AD-SAL Adaptation Parent ................. SKIPPED [INFO] MD-SAL to AD-SAL Adaptation ........................ SKIPPED [INFO] sal-connector-api .................................. SKIPPED [INFO] sal-netconf-connector .............................. SKIPPED [INFO] sal-remote ......................................... SKIPPED [INFO] sal-rest-connector ................................. SKIPPED [INFO] sal-rest-connector-config .......................... SKIPPED [INFO] config-netty-config ................................ SKIPPED [INFO] md-sal-config ...................................... SKIPPED [INFO] netconf-config ..................................... SKIPPED [INFO] netconf-connector-config ........................... SKIPPED [INFO] sal-samples ........................................ SKIPPED [INFO] toaster-config ..................................... SKIPPED [INFO] sal-rest-docgen .................................... SKIPPED [INFO] sal-restconf-broker ................................ SKIPPED [INFO] shutdown-api ....................................... SKIPPED [INFO] shutdown-impl ...................................... SKIPPED [INFO] forwardingrules-manager ............................ SKIPPED [INFO] inventory-manager .................................. SKIPPED [INFO] statistics-manager ................................. SKIPPED [INFO] statistics-manager-config .......................... SKIPPED [INFO] liblldp ............................................ SKIPPED [INFO] topology-lldp-discovery ............................ SKIPPED [INFO] topology-manager ................................... SKIPPED [INFO] sample-toaster ..................................... SKIPPED [INFO] sample-toaster-consumer ............................ SKIPPED [INFO] sample-toaster-provider ............................ SKIPPED [INFO] sal-clustering-config .............................. SKIPPED [INFO] distribution.opendaylight .......................... SKIPPED [INFO] clustering.stub .................................... SKIPPED [INFO] hosttracker.shell .................................. SKIPPED [INFO] hosttrackernew .................................... SKIPPED [INFO] hosttrackernew.implementation ..................... SKIPPED [INFO] containermanager.shell ............................. SKIPPED [INFO] topologymanager.shell .............................. SKIPPED [INFO] karaf-tomcat-security .............................. SKIPPED [INFO] l2switch-model ..................................... SKIPPED [INFO] l2switch-impl ...................................... SKIPPED [INFO] l2switch.aggregator ................................ SKIPPED [INFO] clustering-it ...................................... SKIPPED [INFO] clustering-it-config ............................... SKIPPED [INFO] clustering-it-model ................................ SKIPPED [INFO] clustering-it-provider ............................. SKIPPED [INFO] sal-clustering-commons ............................. SKIPPED [INFO] sal-akka-raft ...................................... SKIPPED [INFO] sal-distributed-datastore .......................... SKIPPED [INFO] sal-dom-xsql ....................................... SKIPPED [INFO] Apache Karaf :: Shell odl/xsql Commands ............ SKIPPED [INFO] sal-dom-xsql-config ................................ SKIPPED [INFO] sal-remoterpc-connector ............................ SKIPPED [INFO] config-persister-feature-adapter ................... SKIPPED [INFO] config-module-archetype ............................ SKIPPED [INFO] protocolplugins.stub .............................. SKIPPED [INFO] dummy-console ...................................... SKIPPED [INFO] releasepom ......................................... SKIPPED [INFO] OpenDaylight :: Karaf :: Branding .................. SKIPPED [INFO] opendaylight-karaf-resources ....................... SKIPPED [INFO] opendaylight-karaf-empty ........................... SKIPPED [INFO] features-base ...................................... SKIPPED [INFO] Features :: AD-SAL Features ........................ SKIPPED [INFO] OpenDaylight :: Features :: Network Service Functions SKIPPED [INFO] features-config .................................... SKIPPED [INFO] features-protocol-framework ........................ SKIPPED [INFO] features-netconf ................................... SKIPPED [INFO] features-config-persister .......................... SKIPPED [INFO] features-config-netty .............................. SKIPPED [INFO] features-akka ...................................... SKIPPED [INFO] features-mdsal ..................................... SKIPPED [INFO] features-flow ...................................... SKIPPED [INFO] features-restconf .................................. SKIPPED [INFO] distribution.opendaylight-karaf .................... SKIPPED [INFO] controller-features ................................ SKIPPED [INFO] extras-features .................................... SKIPPED [INFO] features-adsal-compatibility ....................... SKIPPED [INFO] features-netconf-connector ......................... SKIPPED [INFO] features-controller ................................ SKIPPED [INFO] odl-model-project .................................. SKIPPED [INFO] opendaylight-configfile-archetype .................. SKIPPED [INFO] archetypes-parent .................................. SKIPPED [INFO] distribution-karaf-archetype ....................... SKIPPED [INFO] opendaylight-karaf-features-archetype .............. SKIPPED [INFO] ------------------------------------------------------------------------ [INFO] BUILD FAILURE [INFO] ------------------------------------------------------------------------ [INFO] Total time: 01:05 min [INFO] Finished at: 2015-02-09T15:52:33-08:00 [INFO] Final Memory: 249M/1230M [INFO] ------------------------------------------------------------------------ [ERROR] Failed to execute goal org.codehaus.enunciate:maven-enunciate-plugin:1.28:docs (default) on project connectionmanager.northbound: Execution default of goal org.codehaus.enunci [ERROR] ----------------------------------------------------- [ERROR] realm = plugin>org.codehaus.enunciate:maven-enunciate-plugin:1.28 [ERROR] strategy = org.codehaus.plexus.classworlds.strategy.SelfFirstStrategy [ERROR] urls[0] = file:/C:/Users/aroras/.m2/repository/org/codehaus/enunciate/maven-enunciate-plugin/1.28/maven-enunciate-plugin-1.28.jar [ERROR] urls[1] = file:/F:/JAVA/ODLFeb2015/controller/opendaylight/sal/api/target/sal-0.8.4-SNAPSHOT.jar [ERROR] urls[2] = file:/C:/Users/aroras/.m2/repository/org/apache/commons/commons-lang3/3.1/commons-lang3-3.1.jar [ERROR] urls[3] = file:/C:/Users/aroras/.m2/repository/org/apache/felix/org.apache.felix.dependencymanager/3.1.0/org.apache.felix.dependencymanager-3.1.0.jar [ERROR] urls[4] = file:/C:/Users/aroras/.m2/repository/org/osgi/org.osgi.compendium/4.2.0/org.osgi.compendium-4.2.0.jar [ERROR] urls[5] = file:/C:/Users/aroras/.m2/repository/org/osgi/org.osgi.core/5.0.0/org.osgi.core-5.0.0.jar [ERROR] urls[6] = file:/C:/Users/aroras/.m2/repository/org/slf4j/slf4j-api/1.7.2/slf4j-api-1.7.2.jar [ERROR] urls[7] = file:/C:/Users/aroras/.m2/repository/org/codehaus/enunciate/enunciate-swagger/1.28/enunciate-swagger-1.28.jar [ERROR] urls[8] = file:/C:/Users/aroras/.m2/repository/org/codehaus/jackson/jackson-mapper-asl/1.9.3/jackson-mapper-asl-1.9.3.jar [ERROR] urls[9] = file:/C:/Users/aroras/.m2/repository/org/codehaus/jackson/jackson-core-asl/1.9.3/jackson-core-asl-1.9.3.jar [ERROR] urls[10] = file:/F:/JAVA/ODLFeb2015/controller/opendaylight/commons/logbacksettings/target/commons.logbacksettings-0.0.5-SNAPSHOT.jar [ERROR] urls[11] = file:/C:/Users/aroras/.m2/repository/org/codehaus/enunciate/maven-enunciate-slim-plugin/1.28/maven-enunciate-slim-plugin-1.28.jar [ERROR] urls[12] = file:/C:/Users/aroras/.m2/repository/org/apache/maven/plugins/maven-install-plugin/2.3.1/maven-install-plugin-2.3.1.jar [ERROR] urls[13] = file:/C:/Users/aroras/.m2/repository/org/codehaus/plexus/plexus-digest/1.0/plexus-digest-1.0.jar [ERROR] urls[14] = file:/C:/Users/aroras/.m2/repository/org/apache/maven/plugins/maven-deploy-plugin/2.7/maven-deploy-plugin-2.7.jar [ERROR] urls[15] = file:/C:/Users/aroras/.m2/repository/org/apache/maven/enforcer/enforcer-api/1.0/enforcer-api-1.0.jar [ERROR] urls[16] = file:/C:/Users/aroras/.m2/repository/junit/junit/3.8.1/junit-3.8.1.jar [ERROR] urls[17] = file:/C:/Users/aroras/.m2/repository/org/apache/maven/shared/maven-filtering/1.0/maven-filtering-1.0.jar [ERROR] urls[18] = file:/C:/Users/aroras/.m2/repository/org/apache/maven/reporting/maven-reporting-api/2.0.6/maven-reporting-api-2.0.6.jar [ERROR] urls[19] = file:/C:/Users/aroras/.m2/repository/org/apache/maven/doxia/doxia-sink-api/1.0-alpha-7/doxia-sink-api-1.0-alpha-7.jar [ERROR] urls[20] = file:/C:/Users/aroras/.m2/repository/commons-cli/commons-cli/1.0/commons-cli-1.0.jar [ERROR] urls[21] = file:/C:/Users/aroras/.m2/repository/org/codehaus/plexus/plexus-interactivity-api/1.0-alpha-4/plexus-interactivity-api-1.0-alpha-4.jar [ERROR] urls[22] = file:/C:/Users/aroras/.m2/repository/org/codehaus/plexus/plexus-interpolation/1.12/plexus-interpolation-1.12.jar [ERROR] urls[23] = file:/C:/Users/aroras/.m2/repository/org/sonatype/plexus/plexus-build-api/0.0.4/plexus-build-api-0.0.4.jar [ERROR] urls[24] = file:/C:/Users/aroras/.m2/repository/org/codehaus/plexus/plexus-utils/3.0/plexus-utils-3.0.jar [ERROR] urls[25] = file:/C:/Users/aroras/.m2/repository/org/codehaus/enunciate/enunciate-core/1.28/enunciate-core-1.28.jar [ERROR] urls[26] = file:/C:/Users/aroras/.m2/repository/org/codehaus/enunciate/enunciate-core-rt/1.28/enunciate-core-rt-1.28.jar [ERROR] urls[27] = file:/C:/Users/aroras/.m2/repository/org/codehaus/enunciate/enunciate-core-annotations/1.28/enunciate-core-annotations-1.28.jar [ERROR] urls[28] = file:/C:/Users/aroras/.m2/repository/javax/annotation/jsr250-api/1.0/jsr250-api-1.0.jar [ERROR] urls[29] = file:/C:/Users/aroras/.m2/repository/javax/ws/rs/jsr311-api/1.1.1/jsr311-api-1.1.1.jar [ERROR] urls[30] = file:/C:/Users/aroras/.m2/repository/javax/servlet/servlet-api/2.3/servlet-api-2.3.jar [ERROR] urls[31] = file:/C:/Users/aroras/.m2/repository/org/freemarker/freemarker/2.3.19/freemarker-2.3.19.jar [ERROR] urls[32] = file:/C:/Users/aroras/.m2/repository/net/sf/apt-jelly/apt-jelly-freemarker/2.15/apt-jelly-freemarker-2.15.jar [ERROR] urls[33] = file:/C:/Users/aroras/.m2/repository/net/sf/apt-jelly/apt-jelly-core/2.15/apt-jelly-core-2.15.jar [ERROR] urls[34] = file:/C:/Users/aroras/.m2/repository/commons-digester/commons-digester/2.1/commons-digester-2.1.jar [ERROR] urls[35] = file:/C:/Users/aroras/.m2/repository/commons-beanutils/commons-beanutils/1.8.3/commons-beanutils-1.8.3.jar [ERROR] urls[36] = file:/C:/Users/aroras/.m2/repository/commons-logging/commons-logging/1.1.1/commons-logging-1.1.1.jar [ERROR] urls[37] = file:/C:/Program%20Files/Java/jdk1.8.025/jre/../lib/tools.jar [ERROR] urls[38] = file:/C:/Users/aroras/.m2/repository/org/codehaus/enunciate/enunciate-top/1.28/enunciate-top-1.28.jar [ERROR] urls[39] = file:/C:/Users/aroras/.m2/repository/org/codehaus/enunciate/enunciate-jaxws-support/1.28/enunciate-jaxws-support-1.28.jar [ERROR] urls[40] = file:/C:/Users/aroras/.m2/repository/org/codehaus/enunciate/enunciate-jaxws-ri/1.28/enunciate-jaxws-ri-1.28.jar [ERROR] urls[41] = file:/C:/Users/aroras/.m2/repository/org/codehaus/enunciate/enunciate-docs/1.28/enunciate-docs-1.28.jar [ERROR] urls[42] = file:/C:/Users/aroras/.m2/repository/org/jdom/jdom/1.1.2/jdom-1.1.2.jar [ERROR] urls[43] = file:/C:/Users/aroras/.m2/repository/org/codehaus/enunciate/enunciate-jersey/1.28/enunciate-jersey-1.28.jar [ERROR] urls[44] = file:/C:/Users/aroras/.m2/repository/org/codehaus/enunciate/enunciate-jersey-rt/1.28/enunciate-jersey-rt-1.28.jar [ERROR] urls[45] = file:/C:/Users/aroras/.m2/repository/org/codehaus/jackson/jackson-jaxrs/1.9.3/jackson-jaxrs-1.9.3.jar [ERROR] urls[46] = file:/C:/Users/aroras/.m2/repository/org/codehaus/jackson/jackson-xc/1.9.3/jackson-xc-1.9.3.jar [ERROR] urls[47] = file:/C:/Users/aroras/.m2/repository/com/sun/jersey/jersey-server/1.11/jersey-server-1.11.jar [ERROR] urls[48] = file:/C:/Users/aroras/.m2/repository/asm/asm/3.1/asm-3.1.jar [ERROR] urls[49] = file:/C:/Users/aroras/.m2/repository/com/sun/jersey/jersey-core/1.11/jersey-core-1.11.jar [ERROR] urls[50] = file:/C:/Users/aroras/.m2/repository/com/sun/jersey/jersey-servlet/1.11/jersey-servlet-1.11.jar [ERROR] urls[51] = file:/C:/Users/aroras/.m2/repository/javax/mail/mail/1.4.4/mail-1.4.4.jar [ERROR] urls[52] = file:/C:/Users/aroras/.m2/repository/javax/activation/activation/1.1/activation-1.1.jar [ERROR] urls[53] = file:/C:/Users/aroras/.m2/repository/com/sun/xml/bind/jaxb-impl/2.2.3/jaxb-impl-2.2.3.jar [ERROR] urls[54] = file:/C:/Users/aroras/.m2/repository/org/codehaus/enunciate/enunciate-xml/1.28/enunciate-xml-1.28.jar [ERROR] urls[55] = file:/C:/Users/aroras/.m2/repository/org/codehaus/enunciate/enunciate-java-client/1.28/enunciate-java-client-1.28.jar [ERROR] urls[56] = file:/C:/Users/aroras/.m2/repository/org/codehaus/enunciate/enunciate-c/1.28/enunciate-c-1.28.jar [ERROR] urls[57] = file:/C:/Users/aroras/.m2/repository/org/codehaus/enunciate/enunciate-obj-c/1.28/enunciate-obj-c-1.28.jar [ERROR] urls[58] = file:/C:/Users/aroras/.m2/repository/org/codehaus/enunciate/enunciate-csharp/1.28/enunciate-csharp-1.28.jar [ERROR] urls[59] = file:/C:/Users/aroras/.m2/repository/org/codehaus/enunciate/enunciate-ruby/1.28/enunciate-ruby-1.28.jar [ERROR] urls[60] = file:/C:/Users/aroras/.m2/repository/org/codehaus/enunciate/enunciate-php/1.28/enunciate-php-1.28.jar [ERROR] Number of foreign imports: 1 [ERROR] import: Entry[import from realm ClassRealm[project>org.opendaylight.controller:forwarding.staticrouting:0.5.5-SNAPSHOT, parent: ClassRealm[maven.api, parent: null]]] [ERROR] [ERROR] -----------------------------------------------------: com.sun.mirror.apt.AnnotationProcessorFactory [ERROR] -> [Help 1] [ERROR] [ERROR] To see the full stack trace of the errors, re-run Maven with the -e switch. [ERROR] Re-run Maven using the -X switch to enable full debug logging. [ERROR] [ERROR] For more information about the errors and possible solutions, please read the following articles: [ERROR] [Help 1] http://cwiki.apache.org/confluence/display/MAVEN/PluginContainerException [ERROR] [ERROR] After correcting the problems, you can resume the build with the command [ERROR] mvn <goals> -rf :connectionmanager.northbound F:\JAVA\ODLFeb2015\controller [stable/helium]> java -version java version "1.8.025" Java(TM) SE Runtime Environment (build 1.8.0_25-b18) Java HotSpot(TM) 64-Bit Server VM (build 25.25-b02, mixed mode) F:\JAVA\ODLFeb2015\controller [stable/helium]>

Stable/Helium release of Controller supports Java 1.8.0_25 ?

I am using Java 1.8.0_25 to compile the controller, and that gave following error :

[INFO]
[INFO] --- maven-enunciate-plugin:1.28:docs (default) @ connectionmanager.northbound ---
[INFO] ------------------------------------------------------------------------
[INFO] Reactor Summary:
[INFO]
[INFO] checkstyle ......................................... SUCCESS [  0.655 s]
[INFO] commons.opendaylight ............................... SUCCESS [  1.417 s]
[INFO] sal ................................................ SUCCESS [ 11.604 s]
[INFO] configuration ...................................... SUCCESS [  1.302 s]
[INFO] containermanager ................................... SUCCESS [  0.975 s]
[INFO] usermanager ........................................ SUCCESS [  3.224 s]
[INFO] appauth ............................................ SUCCESS [  0.554 s]
[INFO] clustering.services ................................ SUCCESS [  0.691 s]
[INFO] sal.connection ..................................... SUCCESS [  0.544 s]
[INFO] connectionmanager .................................. SUCCESS [  0.477 s]
[INFO] hosttracker ........................................ SUCCESS [  0.649 s]
[INFO] switchmanager ...................................... SUCCESS [  1.454 s]
[INFO] topologymanager .................................... SUCCESS [  2.257 s]
[INFO] arphandler ......................................... SUCCESS [  1.157 s]
[INFO] bundlescanner ...................................... SUCCESS [  0.469 s]
[INFO] bundlescanner.implementation ....................... SUCCESS [  1.814 s]
[INFO] commons.parent ..................................... SUCCESS [  1.298 s]
[INFO] commons.logbacksettings commons.logback_settings ........................... SUCCESS [  0.139 s]
[INFO] clustering.services-implementation ................. SUCCESS [  6.752 s]
[INFO] clustering.test .................................... SUCCESS [  2.416 s]
[INFO] commons.httpclient ................................. SUCCESS [  1.840 s]
[INFO] commons.northbound ................................. SUCCESS [  9.480 s]
[INFO] configuration.implementation ....................... SUCCESS [  0.602 s]
[INFO] connectionmanager.implementation ................... SUCCESS [  0.614 s]
[INFO] connectionmanager.northbound ....................... FAILURE [  5.667 s]
[INFO] containermanager.implementation .................... SKIPPED
[INFO] web ................................................ SKIPPED
[INFO] containermanager.northbound ........................ SKIPPED
[INFO] controllermanager.northbound ....................... SKIPPED
[INFO] forwarding.staticrouting ........................... SKIPPED
[INFO] forwardingrulesmanager ............................. SKIPPED
[INFO] devices.web ........................................ SKIPPED
[INFO] flowprogrammer.northbound .......................... SKIPPED
[INFO] flows.web .......................................... SKIPPED
[INFO] forwarding.staticrouting.northbound ................ SKIPPED
[INFO] forwardingrulesmanager.implementation .............. SKIPPED
[INFO] hosttracker.implementation ......................... SKIPPED
[INFO] hosttracker.northbound ............................. SKIPPED
[INFO] httpservice-bridge ................................. SKIPPED
[INFO] jolokia-bridge ..................................... SKIPPED
[INFO] logging.bridge ..................................... SKIPPED
[INFO] sal.networkconfiguration ........................... SKIPPED
[INFO] networkconfig.bridgedomain.northbound .............. SKIPPED
[INFO] networkconfig.neutron .............................. SKIPPED
[INFO] networkconfig.neutron.implementation ............... SKIPPED
[INFO] networkconfig.neutron.northbound ................... SKIPPED
[INFO] osgi-brandfragment.web ............................. SKIPPED
[INFO] protocolplugins.openflow protocol_plugins.openflow .......................... SKIPPED
[INFO] routing.dijkstraimplementation routing.dijkstra_implementation .................... SKIPPED
[INFO] sal.connection.implementation ...................... SKIPPED
[INFO] sal.implementation ................................. SKIPPED
[INFO] sal.networkconfiguration.implementation ............ SKIPPED
[INFO] samples.loadbalancer ............................... SKIPPED
[INFO] samples.loadbalancer.northbound .................... SKIPPED
[INFO] samples.simpleforwarding ........................... SKIPPED
[INFO] security ........................................... SKIPPED
[INFO] statisticsmanager .................................. SKIPPED
[INFO] statistics.northbound .............................. SKIPPED
[INFO] statisticsmanager.implementation ................... SKIPPED
[INFO] subnets.northbound ................................. SKIPPED
[INFO] switchmanager.implementation ....................... SKIPPED
[INFO] switchmanager.northbound ........................... SKIPPED
[INFO] topology.northbound ................................ SKIPPED
[INFO] topology.web ....................................... SKIPPED
[INFO] troubleshoot.web ................................... SKIPPED
[INFO] usermanager.implementation ......................... SKIPPED
[INFO] usermanager.northbound ............................. SKIPPED
[INFO] netconf-subsystem .................................. SKIPPED
[INFO] ietf-netconf-monitoring ............................ SKIPPED
[INFO] ietf-netconf-monitoring-extension .................. SKIPPED
[INFO] concepts ........................................... SKIPPED
[INFO] config-subsystem ................................... SKIPPED
[INFO] config-api ......................................... SKIPPED
[INFO] config-util ........................................ SKIPPED
[INFO] config-manager ..................................... SKIPPED
[INFO] config-plugin-parent ............................... SKIPPED
[INFO] yang-jmx-generator ................................. SKIPPED
[INFO] yang-jmx-generator-plugin .......................... SKIPPED
[INFO] netty-config-api ................................... SKIPPED
[INFO] netty-event-executor-config ........................ SKIPPED
[INFO] protocol-framework ................................. SKIPPED
[INFO] netconf-api ........................................ SKIPPED
[INFO] netconf-mapping-api ................................ SKIPPED
[INFO] netconf-util ....................................... SKIPPED
[INFO] commons.thirdparty ................................. SKIPPED
[INFO] ganymed ............................................ SKIPPED
[INFO] netconf-netty-util ................................. SKIPPED
[INFO] netconf-client ..................................... SKIPPED
[INFO] netconf-impl ....................................... SKIPPED
[INFO] yang-test-plugin ................................... SKIPPED
[INFO] yang-test .......................................... SKIPPED
[INFO] config-netconf-connector ........................... SKIPPED
[INFO] config-persister-api ............................... SKIPPED
[INFO] config-persister-file-xml-adapter .................. SKIPPED
[INFO] config-persister-directory-xml-adapter ............. SKIPPED
[INFO] config-persister-impl .............................. SKIPPED
[INFO] filter-valve ....................................... SKIPPED
[INFO] logback-config ..................................... SKIPPED
[INFO] netty-threadgroup-config ........................... SKIPPED
[INFO] threadpool-config-api .............................. SKIPPED
[INFO] threadpool-config-impl ............................. SKIPPED
[INFO] netty-timer-config ................................. SKIPPED
[INFO] netconf-config-dispatcher .......................... SKIPPED
[INFO] netconf-monitoring ................................. SKIPPED
[INFO] netconf-auth ....................................... SKIPPED
[INFO] netconf-ssh ........................................ SKIPPED
[INFO] netconf-usermanager ................................ SKIPPED
[INFO] netconf-tcp ........................................ SKIPPED
[INFO] sal-parent ......................................... SKIPPED
[INFO] sal-common-api ..................................... SKIPPED
[INFO] sal-binding-api .................................... SKIPPED
[INFO] sal-binding-config ................................. SKIPPED
[INFO] sal-binding-util ................................... SKIPPED
[INFO] sal-common-util .................................... SKIPPED
[INFO] sal-common-impl .................................... SKIPPED
[INFO] sal-common ......................................... SKIPPED
[INFO] sal-core-api ....................................... SKIPPED
[INFO] sal-core-spi ....................................... SKIPPED
[INFO] sal-test-model ..................................... SKIPPED
[INFO] sal-inmemory-datastore ............................. SKIPPED
[INFO] sal-broker-impl .................................... SKIPPED
[INFO] model-parent ....................................... SKIPPED
[INFO] model-inventory .................................... SKIPPED
[INFO] model-flow-base .................................... SKIPPED
[INFO] model-flow-service ................................. SKIPPED
[INFO] model-flow-statistics .............................. SKIPPED
[INFO] sal-binding-broker-impl ............................ SKIPPED
[INFO] model-topology ..................................... SKIPPED
[INFO] MD-SAL to AD-SAL Adaptation Parent ................. SKIPPED
[INFO] MD-SAL to AD-SAL Adaptation ........................ SKIPPED
[INFO] sal-connector-api .................................. SKIPPED
[INFO] sal-netconf-connector .............................. SKIPPED
[INFO] sal-remote ......................................... SKIPPED
[INFO] sal-rest-connector ................................. SKIPPED
[INFO] sal-rest-connector-config .......................... SKIPPED
[INFO] config-netty-config ................................ SKIPPED
[INFO] md-sal-config ...................................... SKIPPED
[INFO] netconf-config ..................................... SKIPPED
[INFO] netconf-connector-config ........................... SKIPPED
[INFO] sal-samples ........................................ SKIPPED
[INFO] toaster-config ..................................... SKIPPED
[INFO] sal-rest-docgen .................................... SKIPPED
[INFO] sal-restconf-broker ................................ SKIPPED
[INFO] shutdown-api ....................................... SKIPPED
[INFO] shutdown-impl ...................................... SKIPPED
[INFO] forwardingrules-manager ............................ SKIPPED
[INFO] inventory-manager .................................. SKIPPED
[INFO] statistics-manager ................................. SKIPPED
[INFO] statistics-manager-config .......................... SKIPPED
[INFO] liblldp ............................................ SKIPPED
[INFO] topology-lldp-discovery ............................ SKIPPED
[INFO] topology-manager ................................... SKIPPED
[INFO] sample-toaster ..................................... SKIPPED
[INFO] sample-toaster-consumer ............................ SKIPPED
[INFO] sample-toaster-provider ............................ SKIPPED
[INFO] sal-clustering-config .............................. SKIPPED
[INFO] distribution.opendaylight .......................... SKIPPED
[INFO] clustering.stub .................................... SKIPPED
[INFO] hosttracker.shell .................................. SKIPPED
[INFO] hosttrackernew hosttracker_new .................................... SKIPPED
[INFO] hosttrackernew.implementation hosttracker_new.implementation ..................... SKIPPED
[INFO] containermanager.shell ............................. SKIPPED
[INFO] topologymanager.shell .............................. SKIPPED
[INFO] karaf-tomcat-security .............................. SKIPPED
[INFO] l2switch-model ..................................... SKIPPED
[INFO] l2switch-impl ...................................... SKIPPED
[INFO] l2switch.aggregator ................................ SKIPPED
[INFO] clustering-it ...................................... SKIPPED
[INFO] clustering-it-config ............................... SKIPPED
[INFO] clustering-it-model ................................ SKIPPED
[INFO] clustering-it-provider ............................. SKIPPED
[INFO] sal-clustering-commons ............................. SKIPPED
[INFO] sal-akka-raft ...................................... SKIPPED
[INFO] sal-distributed-datastore .......................... SKIPPED
[INFO] sal-dom-xsql ....................................... SKIPPED
[INFO] Apache Karaf :: Shell odl/xsql Commands ............ SKIPPED
[INFO] sal-dom-xsql-config ................................ SKIPPED
[INFO] sal-remoterpc-connector ............................ SKIPPED
[INFO] config-persister-feature-adapter ................... SKIPPED
[INFO] config-module-archetype ............................ SKIPPED
[INFO] protocolplugins.stub protocol_plugins.stub .............................. SKIPPED
[INFO] dummy-console ...................................... SKIPPED
[INFO] releasepom ......................................... SKIPPED
[INFO] OpenDaylight :: Karaf :: Branding .................. SKIPPED
[INFO] opendaylight-karaf-resources ....................... SKIPPED
[INFO] opendaylight-karaf-empty ........................... SKIPPED
[INFO] features-base ...................................... SKIPPED
[INFO] Features :: AD-SAL Features ........................ SKIPPED
[INFO] OpenDaylight :: Features :: Network Service Functions SKIPPED
[INFO] features-config .................................... SKIPPED
[INFO] features-protocol-framework ........................ SKIPPED
[INFO] features-netconf ................................... SKIPPED
[INFO] features-config-persister .......................... SKIPPED
[INFO] features-config-netty .............................. SKIPPED
[INFO] features-akka ...................................... SKIPPED
[INFO] features-mdsal ..................................... SKIPPED
[INFO] features-flow ...................................... SKIPPED
[INFO] features-restconf .................................. SKIPPED
[INFO] distribution.opendaylight-karaf .................... SKIPPED
[INFO] controller-features ................................ SKIPPED
[INFO] extras-features .................................... SKIPPED
[INFO] features-adsal-compatibility ....................... SKIPPED
[INFO] features-netconf-connector ......................... SKIPPED
[INFO] features-controller ................................ SKIPPED
[INFO] odl-model-project .................................. SKIPPED
[INFO] opendaylight-configfile-archetype .................. SKIPPED
[INFO] archetypes-parent .................................. SKIPPED
[INFO] distribution-karaf-archetype ....................... SKIPPED
[INFO] opendaylight-karaf-features-archetype .............. SKIPPED
[INFO] ------------------------------------------------------------------------
[INFO] BUILD FAILURE
[INFO] ------------------------------------------------------------------------
[INFO] Total time: 01:05 min
[INFO] Finished at: 2015-02-09T15:52:33-08:00
[INFO] Final Memory: 249M/1230M
[INFO] ------------------------------------------------------------------------
[ERROR] Failed to execute goal org.codehaus.enunciate:maven-enunciate-plugin:1.28:docs (default) on project connectionmanager.northbound: Execution default of goal org.codehaus.enunci
[ERROR] -----------------------------------------------------
[ERROR] realm =    plugin>org.codehaus.enunciate:maven-enunciate-plugin:1.28
[ERROR] strategy = org.codehaus.plexus.classworlds.strategy.SelfFirstStrategy
[ERROR] urls[0] = file:/C:/Users/aroras/.m2/repository/org/codehaus/enunciate/maven-enunciate-plugin/1.28/maven-enunciate-plugin-1.28.jar
[ERROR] urls[1] = file:/F:/JAVA/ODLFeb2015/controller/opendaylight/sal/api/target/sal-0.8.4-SNAPSHOT.jar
[ERROR] urls[2] = file:/C:/Users/aroras/.m2/repository/org/apache/commons/commons-lang3/3.1/commons-lang3-3.1.jar
[ERROR] urls[3] = file:/C:/Users/aroras/.m2/repository/org/apache/felix/org.apache.felix.dependencymanager/3.1.0/org.apache.felix.dependencymanager-3.1.0.jar
[ERROR] urls[4] = file:/C:/Users/aroras/.m2/repository/org/osgi/org.osgi.compendium/4.2.0/org.osgi.compendium-4.2.0.jar
[ERROR] urls[5] = file:/C:/Users/aroras/.m2/repository/org/osgi/org.osgi.core/5.0.0/org.osgi.core-5.0.0.jar
[ERROR] urls[6] = file:/C:/Users/aroras/.m2/repository/org/slf4j/slf4j-api/1.7.2/slf4j-api-1.7.2.jar
[ERROR] urls[7] = file:/C:/Users/aroras/.m2/repository/org/codehaus/enunciate/enunciate-swagger/1.28/enunciate-swagger-1.28.jar
[ERROR] urls[8] = file:/C:/Users/aroras/.m2/repository/org/codehaus/jackson/jackson-mapper-asl/1.9.3/jackson-mapper-asl-1.9.3.jar
[ERROR] urls[9] = file:/C:/Users/aroras/.m2/repository/org/codehaus/jackson/jackson-core-asl/1.9.3/jackson-core-asl-1.9.3.jar
[ERROR] urls[10] = file:/F:/JAVA/ODLFeb2015/controller/opendaylight/commons/logbacksettings/target/commons.logbacksettings-0.0.5-SNAPSHOT.jar
file:/F:/JAVA/ODLFeb2015/controller/opendaylight/commons/logback_settings/target/commons.logback_settings-0.0.5-SNAPSHOT.jar
[ERROR] urls[11] = file:/C:/Users/aroras/.m2/repository/org/codehaus/enunciate/maven-enunciate-slim-plugin/1.28/maven-enunciate-slim-plugin-1.28.jar
[ERROR] urls[12] = file:/C:/Users/aroras/.m2/repository/org/apache/maven/plugins/maven-install-plugin/2.3.1/maven-install-plugin-2.3.1.jar
[ERROR] urls[13] = file:/C:/Users/aroras/.m2/repository/org/codehaus/plexus/plexus-digest/1.0/plexus-digest-1.0.jar
[ERROR] urls[14] = file:/C:/Users/aroras/.m2/repository/org/apache/maven/plugins/maven-deploy-plugin/2.7/maven-deploy-plugin-2.7.jar
[ERROR] urls[15] = file:/C:/Users/aroras/.m2/repository/org/apache/maven/enforcer/enforcer-api/1.0/enforcer-api-1.0.jar
[ERROR] urls[16] = file:/C:/Users/aroras/.m2/repository/junit/junit/3.8.1/junit-3.8.1.jar
[ERROR] urls[17] = file:/C:/Users/aroras/.m2/repository/org/apache/maven/shared/maven-filtering/1.0/maven-filtering-1.0.jar
[ERROR] urls[18] = file:/C:/Users/aroras/.m2/repository/org/apache/maven/reporting/maven-reporting-api/2.0.6/maven-reporting-api-2.0.6.jar
[ERROR] urls[19] = file:/C:/Users/aroras/.m2/repository/org/apache/maven/doxia/doxia-sink-api/1.0-alpha-7/doxia-sink-api-1.0-alpha-7.jar
[ERROR] urls[20] = file:/C:/Users/aroras/.m2/repository/commons-cli/commons-cli/1.0/commons-cli-1.0.jar
[ERROR] urls[21] = file:/C:/Users/aroras/.m2/repository/org/codehaus/plexus/plexus-interactivity-api/1.0-alpha-4/plexus-interactivity-api-1.0-alpha-4.jar
[ERROR] urls[22] = file:/C:/Users/aroras/.m2/repository/org/codehaus/plexus/plexus-interpolation/1.12/plexus-interpolation-1.12.jar
[ERROR] urls[23] = file:/C:/Users/aroras/.m2/repository/org/sonatype/plexus/plexus-build-api/0.0.4/plexus-build-api-0.0.4.jar
[ERROR] urls[24] = file:/C:/Users/aroras/.m2/repository/org/codehaus/plexus/plexus-utils/3.0/plexus-utils-3.0.jar
[ERROR] urls[25] = file:/C:/Users/aroras/.m2/repository/org/codehaus/enunciate/enunciate-core/1.28/enunciate-core-1.28.jar
[ERROR] urls[26] = file:/C:/Users/aroras/.m2/repository/org/codehaus/enunciate/enunciate-core-rt/1.28/enunciate-core-rt-1.28.jar
[ERROR] urls[27] = file:/C:/Users/aroras/.m2/repository/org/codehaus/enunciate/enunciate-core-annotations/1.28/enunciate-core-annotations-1.28.jar
[ERROR] urls[28] = file:/C:/Users/aroras/.m2/repository/javax/annotation/jsr250-api/1.0/jsr250-api-1.0.jar
[ERROR] urls[29] = file:/C:/Users/aroras/.m2/repository/javax/ws/rs/jsr311-api/1.1.1/jsr311-api-1.1.1.jar
[ERROR] urls[30] = file:/C:/Users/aroras/.m2/repository/javax/servlet/servlet-api/2.3/servlet-api-2.3.jar
[ERROR] urls[31] = file:/C:/Users/aroras/.m2/repository/org/freemarker/freemarker/2.3.19/freemarker-2.3.19.jar
[ERROR] urls[32] = file:/C:/Users/aroras/.m2/repository/net/sf/apt-jelly/apt-jelly-freemarker/2.15/apt-jelly-freemarker-2.15.jar
[ERROR] urls[33] = file:/C:/Users/aroras/.m2/repository/net/sf/apt-jelly/apt-jelly-core/2.15/apt-jelly-core-2.15.jar
[ERROR] urls[34] = file:/C:/Users/aroras/.m2/repository/commons-digester/commons-digester/2.1/commons-digester-2.1.jar
[ERROR] urls[35] = file:/C:/Users/aroras/.m2/repository/commons-beanutils/commons-beanutils/1.8.3/commons-beanutils-1.8.3.jar
[ERROR] urls[36] = file:/C:/Users/aroras/.m2/repository/commons-logging/commons-logging/1.1.1/commons-logging-1.1.1.jar
[ERROR] urls[37] = file:/C:/Program%20Files/Java/jdk1.8.025/jre/../lib/tools.jar
file:/C:/Program%20Files/Java/jdk1.8.0_25/jre/../lib/tools.jar
[ERROR] urls[38] = file:/C:/Users/aroras/.m2/repository/org/codehaus/enunciate/enunciate-top/1.28/enunciate-top-1.28.jar
[ERROR] urls[39] = file:/C:/Users/aroras/.m2/repository/org/codehaus/enunciate/enunciate-jaxws-support/1.28/enunciate-jaxws-support-1.28.jar
[ERROR] urls[40] = file:/C:/Users/aroras/.m2/repository/org/codehaus/enunciate/enunciate-jaxws-ri/1.28/enunciate-jaxws-ri-1.28.jar
[ERROR] urls[41] = file:/C:/Users/aroras/.m2/repository/org/codehaus/enunciate/enunciate-docs/1.28/enunciate-docs-1.28.jar
[ERROR] urls[42] = file:/C:/Users/aroras/.m2/repository/org/jdom/jdom/1.1.2/jdom-1.1.2.jar
[ERROR] urls[43] = file:/C:/Users/aroras/.m2/repository/org/codehaus/enunciate/enunciate-jersey/1.28/enunciate-jersey-1.28.jar
[ERROR] urls[44] = file:/C:/Users/aroras/.m2/repository/org/codehaus/enunciate/enunciate-jersey-rt/1.28/enunciate-jersey-rt-1.28.jar
[ERROR] urls[45] = file:/C:/Users/aroras/.m2/repository/org/codehaus/jackson/jackson-jaxrs/1.9.3/jackson-jaxrs-1.9.3.jar
[ERROR] urls[46] = file:/C:/Users/aroras/.m2/repository/org/codehaus/jackson/jackson-xc/1.9.3/jackson-xc-1.9.3.jar
[ERROR] urls[47] = file:/C:/Users/aroras/.m2/repository/com/sun/jersey/jersey-server/1.11/jersey-server-1.11.jar
[ERROR] urls[48] = file:/C:/Users/aroras/.m2/repository/asm/asm/3.1/asm-3.1.jar
[ERROR] urls[49] = file:/C:/Users/aroras/.m2/repository/com/sun/jersey/jersey-core/1.11/jersey-core-1.11.jar
[ERROR] urls[50] = file:/C:/Users/aroras/.m2/repository/com/sun/jersey/jersey-servlet/1.11/jersey-servlet-1.11.jar
[ERROR] urls[51] = file:/C:/Users/aroras/.m2/repository/javax/mail/mail/1.4.4/mail-1.4.4.jar
[ERROR] urls[52] = file:/C:/Users/aroras/.m2/repository/javax/activation/activation/1.1/activation-1.1.jar
[ERROR] urls[53] = file:/C:/Users/aroras/.m2/repository/com/sun/xml/bind/jaxb-impl/2.2.3/jaxb-impl-2.2.3.jar
[ERROR] urls[54] = file:/C:/Users/aroras/.m2/repository/org/codehaus/enunciate/enunciate-xml/1.28/enunciate-xml-1.28.jar
[ERROR] urls[55] = file:/C:/Users/aroras/.m2/repository/org/codehaus/enunciate/enunciate-java-client/1.28/enunciate-java-client-1.28.jar
[ERROR] urls[56] = file:/C:/Users/aroras/.m2/repository/org/codehaus/enunciate/enunciate-c/1.28/enunciate-c-1.28.jar
[ERROR] urls[57] = file:/C:/Users/aroras/.m2/repository/org/codehaus/enunciate/enunciate-obj-c/1.28/enunciate-obj-c-1.28.jar
[ERROR] urls[58] = file:/C:/Users/aroras/.m2/repository/org/codehaus/enunciate/enunciate-csharp/1.28/enunciate-csharp-1.28.jar
[ERROR] urls[59] = file:/C:/Users/aroras/.m2/repository/org/codehaus/enunciate/enunciate-ruby/1.28/enunciate-ruby-1.28.jar
[ERROR] urls[60] = file:/C:/Users/aroras/.m2/repository/org/codehaus/enunciate/enunciate-php/1.28/enunciate-php-1.28.jar
[ERROR] Number of foreign imports: 1
[ERROR] import: Entry[import  from realm ClassRealm[project>org.opendaylight.controller:forwarding.staticrouting:0.5.5-SNAPSHOT, parent: ClassRealm[maven.api, parent: null]]]
[ERROR]
[ERROR] -----------------------------------------------------: com.sun.mirror.apt.AnnotationProcessorFactory
[ERROR] -> [Help 1]
[ERROR]
[ERROR] To see the full stack trace of the errors, re-run Maven with the -e switch.
[ERROR] Re-run Maven using the -X switch to enable full debug logging.
[ERROR]
[ERROR] For more information about the errors and possible solutions, please read the following articles:
[ERROR] [Help 1] http://cwiki.apache.org/confluence/display/MAVEN/PluginContainerException
[ERROR]
[ERROR] After correcting the problems, you can resume the build with the command
[ERROR]   mvn <goals> -rf :connectionmanager.northbound
F:\JAVA\ODLFeb2015\controller [stable/helium]> java -version
java version "1.8.025"
"1.8.0_25"
Java(TM) SE Runtime Environment (build 1.8.0_25-b18)
Java HotSpot(TM) 64-Bit Server VM (build 25.25-b02, mixed mode)
F:\JAVA\ODLFeb2015\controller [stable/helium]>

[stable/helium]>