Ask is moving to Stack Overflow and Serverfault.com! Please use the "opendaylight" tag on either of these sites. This site is now in Read-Only mode

Revision history [back]

click to hide/show revision 1
initial version

Unable to build the hello project

Hi Folks, I was following this link to workout the hello project. But failing at Exercise 1 - "mvn -nsu clean install"[https://wiki.opendaylight.org/view/ControllerCoreFunctionalityTutorials:ApplicationDevelopment_Tutorial] with the following error.

INFO: Waiting for remote bundle context.. on 21000 name: b3909a5f-872a-43af-b896-4f4b619559e5 timout: [ RelativeTimeout value = 180000 ] 2016-01-02 09:05:40,774 | INFO | ion(3)-127.0.0.1 | SingleFeatureTest | 84 - PAXEXAM-PROBE-e2caa69c-7d9d-45ff-b017-0747cfa76574 - 0.0.0 | Attempting to add repository file:/home/odldev/git/hello/features/target/classes/features.xml 2016-01-02 09:05:40,866 | INFO | ion(3)-127.0.0.1 | SingleFeatureTest | 84 - PAXEXAM-PROBE-e2caa69c-7d9d-45ff-b017-0747cfa76574 - 0.0.0 | Successfully loaded repository file:/home/odldev/git/hello/features/target/classes/features.xml 2016-01-02 09:05:40,866 | INFO | ion(3)-127.0.0.1 | SingleFeatureTest | 84 - PAXEXAM-PROBE-e2caa69c-7d9d-45ff-b017-0747cfa76574 - 0.0.0 | Attempting to install feature odl-hello-api 1.0.0-SNAPSHOT 2016-01-02 09:05:41,269 | WARN | ion(3)-127.0.0.1 | AetherBasedResolver | 1 - org.ops4j.pax.url.mvn - 2.2.0 | Error resolving artifactorg.opendaylight.aaa:features-aaa-shiro:xml:features:0.3.0-SNAPSHOT:Could not find artifact org.opendaylight.aaa:features-aaa-shiro:xml:features:0.3.0-SNAPSHOT shaded.org.eclipse.aether.resolution.ArtifactResolutionException: Could not find artifact org.opendaylight.aaa:features-aaa-shiro:xml:features:0.3.0-SNAPSHOT at shaded.org.eclipse.aether.internal.impl.DefaultArtifactResolver.resolve(DefaultArtifactResolver.java:444) at shaded.org.eclipse.aether.internal.impl.DefaultArtifactResolver.resolveArtifacts(DefaultArtifactResolver.java:246) at shaded.org.eclipse.aether.internal.impl.DefaultArtifactResolver.resolveArtifact(DefaultArtifactResolver.java:223) at shaded.org.eclipse.aether.internal.impl.DefaultRepositorySystem.resolveArtifact(DefaultRepositorySystem.java:294) at org.ops4j.pax.url.mvn.internal.AetherBasedResolver.resolve(AetherBasedResolver.java:344) at org.ops4j.pax.url.mvn.internal.AetherBasedResolver.resolveFile(AetherBasedResolver.java:313) at org.ops4j.pax.url.mvn.internal.AetherBasedResolver.resolve(AetherBasedResolver.java:297) at org.ops4j.pax.url.mvn.internal.Connection.getInputStream(Connection.java:131) at org.apache.karaf.features.internal.FeatureValidationUtil.load(FeatureValidationUtil.java:93) at org.apache.karaf.features.internal.FeatureValidationUtil.validate(FeatureValidationUtil.java:58) at org.apache.karaf.features.internal.FeaturesServiceImpl.validateRepository(FeaturesServiceImpl.java:162) at org.apache.karaf.features.internal.FeaturesServiceImpl.internalAddRepository(FeaturesServiceImpl.java:233) at org.apache.karaf.features.internal.FeaturesServiceImpl.getFeatures(FeaturesServiceImpl.java:813) at org.apache.karaf.features.internal.FeaturesServiceImpl.getFeature(FeaturesServiceImpl.java:771) at org.apache.karaf.features.internal.FeaturesServiceImpl.installFeature(FeaturesServiceImpl.java:359) at org.apache.karaf.features.internal.FeaturesServiceImpl.installFeature(FeaturesServiceImpl.java:347) at Proxy7e73e05b6bf2437e9eff189d0f002f62.installFeature(Unknown Source) at org.opendaylight.odlparent.featuretest.SingleFeatureTest.installFeature(SingleFeatureTest.java:207) at sun.reflect.NativeMethodAccessorImpl.invoke0(Native Method)[:1.8.045] at sun.reflect.NativeMethodAccessorImpl.invoke(NativeMethodAccessorImpl.java:62)[:1.8.045] at sun.reflect.DelegatingMethodAccessorImpl.invoke(DelegatingMethodAccessorImpl.java:43)[:1.8.045] at java.lang.reflect.Method.invoke(Method.java:497)[:1.8.045] at org.junit.runners.model.FrameworkMethod$1.runReflectiveCall(FrameworkMethod.java:50) at org.junit.internal.runners.model.ReflectiveCallable.run(ReflectiveCallable.java:12) at org.junit.runners.model.FrameworkMethod.invokeExplosively(FrameworkMethod.java:47) at org.junit.internal.runners.statements.InvokeMethod.evaluate(InvokeMethod.java:17) at org.junit.internal.runners.statements.RunBefores.evaluate(RunBefores.java:26) at org.junit.runners.ParentRunner.runLeaf(ParentRunner.java:325) at org.junit.runners.BlockJUnit4ClassRunner.runChild(BlockJUnit4ClassRunner.java:78) at org.ops4j.pax.exam.invoker.junit.internal.ContainerTestRunner.runChild(ContainerTestRunner.java:68) at org.ops4j.pax.exam.invoker.junit.internal.ContainerTestRunner.runChild(ContainerTestRunner.java:37) at org.junit.runners.ParentRunner$3.run(ParentRunner.java:290) at org.junit.runners.ParentRunner$1.schedule(ParentRunner.java:71) at org.junit.runners.ParentRunner.runChildren(ParentRunner.java:288) at org.junit.runners.ParentRunner.access$000(ParentRunner.java:58) at org.junit.runners.ParentRunner$2.evaluate(ParentRunner.java:268) at org.junit.runners.ParentRunner.run(ParentRunner.java:363) at org.junit.runner.JUnitCore.run(JUnitCore.java:137) at org.junit.runner.JUnitCore.run(JUnitCore.java:115) at org.ops4j.pax.exam.invoker.junit.internal.JUnitProbeInvoker.invokeViaJUnit(JUnitProbeInvoker.java:124) at org.ops4j.pax.exam.invoker.junit.internal.JUnitProbeInvoker.findAndInvoke(JUnitProbeInvoker.java:97) at org.ops4j.pax.exam.invoker.junit.internal.JUnitProbeInvoker.call(JUnitProbeInvoker.java:73) at sun.reflect.NativeMethodAccessorImpl.invoke0(Native Method)[:1.8.045] at sun.reflect.NativeMethodAccessorImpl.invoke(NativeMethodAccessorImpl.java:62)[:1.8.045] at sun.reflect.DelegatingMethodAccessorImpl.invoke(DelegatingMethodAccessorImpl.java:43)[:1.8.045] at java.lang.reflect.Method.invoke(Method.java:497)[:1.8.045] at org.ops4j.pax.exam.rbc.internal.RemoteBundleContextImpl.remoteCall(RemoteBundleContextImpl.java:80) at sun.reflect.NativeMethodAccessorImpl.invoke0(Native Method)[:1.8.045] at sun.reflect.NativeMethodAccessorImpl.invoke(NativeMethodAccessorImpl.java:62)[:1.8.045] at sun.reflect.DelegatingMethodAccessorImpl.invoke(DelegatingMethodAccessorImpl.java:43)[:1.8.045] at java.lang.reflect.Method.invoke(Method.java:497)[:1.8.045] at sun.rmi.server.UnicastServerRef.dispatch(UnicastServerRef.java:323)[:1.8.045] at sun.rmi.transport.Transport$1.run(Transport.java:200)[:1.8.045] at sun.rmi.transport.Transport$1.run(Transport.java:197)[:1.8.045] at java.security.AccessController.doPrivileged(Native Method)[:1.8.045] at sun.rmi.transport.Transport.serviceCall(Transport.java:196)[:1.8.045] at sun.rmi.transport.tcp.TCPTransport.handleMessages(TCPTransport.java:568)[:1.8.045] at sun.rmi.transport.tcp.TCPTransport$ConnectionHandler.run0(TCPTransport.java:826)[:1.8.045] at sun.rmi.transport.tcp.TCPTransport$ConnectionHandler.lambda$run$241(TCPTransport.java:683)[:1.8.045] at sun.rmi.transport.tcp.TCPTransport$ConnectionHandler$$Lambda$1/1292811496.run(Unknown Source) at java.security.AccessController.doPrivileged(Native Method)[:1.8.045] at sun.rmi.transport.tcp.TCPTransport$ConnectionHandler.run(TCPTransport.java:682)[:1.8.045] at java.util.concurrent.ThreadPoolExecutor.runWorker(ThreadPoolExecutor.java:1142)[:1.8.045] at java.util.concurrent.ThreadPoolExecutor$Worker.run(ThreadPoolExecutor.java:617)[:1.8.045] at java.lang.Thread.run(Thread.java:745)[:1.8.045] Caused by: shaded.org.eclipse.aether.transfer.ArtifactNotFoundException: Could not find artifact org.opendaylight.aaa:features-aaa-shiro:xml:features:0.3.0-SNAPSHOT at shaded.org.eclipse.aether.internal.impl.DefaultArtifactResolver.resolve(DefaultArtifactResolver.java:434) ... 64 more 2016-01-02 09:05:41,860 | WARN | FelixShutdown | core | 75 - org.apache.aries.jmx.core - 1.1.2 | Task rejected for JMX Notification dispatch of event [org.osgi.framework.ServiceEvent[source=[javax.management.MBeanServer]]] - Dispatcher may have been shutdown Jan 02, 2016 9:05:42 AM org.ops4j.pax.exam.spi.reactors.ReactorManager afterClass INFO: suite finished Jan 02, 2016 9:05:42 AM org.opendaylight.odlparent.featuretest.PerRepoTestRunner runChild INFO: About to run test for file:/home/odldev/git/hello/features/target/classes/features.xml Jan 02, 2016 9:05:42 AM org.opendaylight.odlparent.featuretest.PerFeatureRunner run INFO: About to run test for feature: odl-hello 1.0.0-SNAPSHOT Jan 02, 2016 9:05:42 AM org.ops4j.pax.exam.junit.impl.ProbeRunner run INFO: running test class org.opendaylight.odlparent.featuretest.SingleFeatureTest Jan 02, 2016 9:05:43 AM org.ops4j.pax.exam.karaf.container.internal.KarafTestContainer startKaraf INFO: Wait for test container to finish its initialization [ RelativeTimeout value = 180000 ] Jan 02, 2016 9:05:43 AM org.ops4j.pax.exam.rbc.client.intern.RemoteBundleContextClientImpl getRemoteBundleContext INFO: Waiting for remote bundle context.. on 21000 name: 92d51f8e-859f-4f70-b74d-83041e836fb4 timout: [ RelativeTimeout value = 180000 ] 2016-01-02 09:05:52,484 | INFO | ion(3)-127.0.0.1 | SingleFeatureTest | 84 - PAXEXAM-PROBE-e2caa69c-7d9d-45ff-b017-0747cfa76574 - 0.0.0 | Attempting to add repository file:/home/odldev/git/hello/features/target/classes/features.xml 2016-01-02 09:05:52,511 | INFO | ion(3)-127.0.0.1 | SingleFeatureTest | 84 - PAXEXAM-PROBE-e2caa69c-7d9d-45ff-b017-0747cfa76574 - 0.0.0 | Successfully loaded repository file:/home/odldev/git/hello/features/target/classes/features.xml 2016-01-02 09:05:52,511 | INFO | ion(3)-127.0.0.1 | SingleFeatureTest | 84 - PAXEXAM-PROBE-e2caa69c-7d9d-45ff-b017-0747cfa76574 - 0.0.0 | Attempting to install feature odl-hello 1.0.0-SNAPSHOT 2016-01-02 09:05:52,741 | WARN | ion(3)-127.0.0.1 | AetherBasedResolver | 1 - org.ops4j.pax.url.mvn - 2.2.0 | Error resolving artifactorg.opendaylight.aaa:features-aaa-shiro:xml:features:0.3.0-SNAPSHOT:Could not find artifact org.opendaylight.aaa:features-aaa-shiro:xml:features:0.3.0-SNAPSHOT shaded.org.eclipse.aether.resolution.ArtifactResolutionException: Could not find artifact org.opendaylight.aaa:features-aaa-shiro:xml:features:0.3.0-SNAPSHOT at shaded.org.eclipse.aether.internal.impl.DefaultArtifactResolver.resolve(DefaultArtifactResolver.java:444) at shaded.org.eclipse.aether.internal.impl.DefaultArtifactResolver.resolveArtifacts(DefaultArtifactResolver.java:246) at shaded.org.eclipse.aether.internal.impl.DefaultArtifactResolver.resolveArtifact(DefaultArtifactResolver.java:223) at shaded.org.eclipse.aether.internal.impl.DefaultRepositorySystem.resolveArtifact(DefaultRepositorySystem.java:294) at org.ops4j.pax.url.mvn.internal.AetherBasedResolver.resolve(AetherBasedResolver.java:344) at org.ops4j.pax.url.mvn.internal.AetherBasedResolver.resolveFile(AetherBasedResolver.java:313) at org.ops4j.pax.url.mvn.internal.AetherBasedResolver.resolve(AetherBasedResolver.java:297) at org.ops4j.pax.url.mvn.internal.Connection.getInputStream(Connection.java:131) at org.apache.karaf.features.internal.FeatureValidationUtil.load(FeatureValidationUtil.java:93) at org.apache.karaf.features.internal.FeatureValidationUtil.validate(FeatureValidationUtil.java:58) at org.apache.karaf.features.internal.FeaturesServiceImpl.validateRepository(FeaturesServiceImpl.java:162) at org.apache.karaf.features.internal.FeaturesServiceImpl.internalAddRepository(FeaturesServiceImpl.java:233) at org.apache.karaf.features.internal.FeaturesServiceImpl.getFeatures(FeaturesServiceImpl.java:813) at org.apache.karaf.features.internal.FeaturesServiceImpl.getFeature(FeaturesServiceImpl.java:771) at org.apache.karaf.features.internal.FeaturesServiceImpl.installFeature(FeaturesServiceImpl.java:359) at org.apache.karaf.features.internal.FeaturesServiceImpl.installFeature(FeaturesServiceImpl.java:347) at Proxy8e3ebab468b24ee9aa60a6c7c22d1e8a.installFeature(Unknown Source) at org.opendaylight.odlparent.featuretest.SingleFeatureTest.installFeature(SingleFeatureTest.java:207) at sun.reflect.NativeMethodAccessorImpl.invoke0(Native Method)[:1.8.045] at sun.reflect.NativeMethodAccessorImpl.invoke(NativeMethodAccessorImpl.java:62)[:1.8.045] at sun.reflect.DelegatingMethodAccessorImpl.invoke(DelegatingMethodAccessorImpl.java:43)[:1.8.045] at java.lang.reflect.Method.invoke(Method.java:497)[:1.8.045] at org.junit.runners.model.FrameworkMethod$1.runReflectiveCall(FrameworkMethod.java:50) at org.junit.internal.runners.model.ReflectiveCallable.run(ReflectiveCallable.java:12) at org.junit.runners.model.FrameworkMethod.invokeExplosively(FrameworkMethod.java:47) at org.junit.internal.runners.statements.InvokeMethod.evaluate(InvokeMethod.java:17) at org.junit.internal.runners.statements.RunBefores.evaluate(RunBefores.java:26) at org.junit.runners.ParentRunner.runLeaf(ParentRunner.java:325) at org.junit.runners.BlockJUnit4ClassRunner.runChild(BlockJUnit4ClassRunner.java:78) at org.ops4j.pax.exam.invoker.junit.internal.ContainerTestRunner.runChild(ContainerTestRunner.java:68) at org.ops4j.pax.exam.invoker.junit.internal.ContainerTestRunner.runChild(ContainerTestRunner.java:37) at org.junit.runners.ParentRunner$3.run(ParentRunner.java:290) at org.junit.runners.ParentRunner$1.schedule(ParentRunner.java:71) at org.junit.runners.ParentRunner.runChildren(ParentRunner.java:288) at org.junit.runners.ParentRunner.access$000(ParentRunner.java:58) at org.junit.runners.ParentRunner$2.evaluate(ParentRunner.java:268) at org.junit.runners.ParentRunner.run(ParentRunner.java:363) at org.junit.runner.JUnitCore.run(JUnitCore.java:137) at org.junit.runner.JUnitCore.run(JUnitCore.java:115) at org.ops4j.pax.exam.invoker.junit.internal.JUnitProbeInvoker.invokeViaJUnit(JUnitProbeInvoker.java:124) at org.ops4j.pax.exam.invoker.junit.internal.JUnitProbeInvoker.findAndInvoke(JUnitProbeInvoker.java:97) at org.ops4j.pax.exam.invoker.junit.internal.JUnitProbeInvoker.call(JUnitProbeInvoker.java:73) at sun.reflect.NativeMethodAccessorImpl.invoke0(Native Method)[:1.8.045] at sun.reflect.NativeMethodAccessorImpl.invoke(NativeMethodAccessorImpl.java:62)[:1.8.045] at sun.reflect.DelegatingMethodAccessorImpl.invoke(DelegatingMethodAccessorImpl.java:43)[:1.8.045] at java.lang.reflect.Method.invoke(Method.java:497)[:1.8.045] at org.ops4j.pax.exam.rbc.internal.RemoteBundleContextImpl.remoteCall(RemoteBundleContextImpl.java:80) at sun.reflect.NativeMethodAccessorImpl.invoke0(Native Method)[:1.8.045] at sun.reflect.NativeMethodAccessorImpl.invoke(NativeMethodAccessorImpl.java:62)[:1.8.045] at sun.reflect.DelegatingMethodAccessorImpl.invoke(DelegatingMethodAccessorImpl.java:43)[:1.8.045] at java.lang.reflect.Method.invoke(Method.java:497)[:1.8.045] at sun.rmi.server.UnicastServerRef.dispatch(UnicastServerRef.java:323)[:1.8.045] at sun.rmi.transport.Transport$1.run(Transport.java:200)[:1.8.045] at sun.rmi.transport.Transport$1.run(Transport.java:197)[:1.8.045] at java.security.AccessController.doPrivileged(Native Method)[:1.8.045] at sun.rmi.transport.Transport.serviceCall(Transport.java:196)[:1.8.045] at sun.rmi.transport.tcp.TCPTransport.handleMessages(TCPTransport.java:568)[:1.8.045] at sun.rmi.transport.tcp.TCPTransport$ConnectionHandler.run0(TCPTransport.java:826)[:1.8.045] at sun.rmi.transport.tcp.TCPTransport$ConnectionHandler.lambda$run$241(TCPTransport.java:683)[:1.8.045] at sun.rmi.transport.tcp.TCPTransport$ConnectionHandler$$Lambda$1/590623838.run(Unknown Source) at java.security.AccessController.doPrivileged(Native Method)[:1.8.045] at sun.rmi.transport.tcp.TCPTransport$ConnectionHandler.run(TCPTransport.java:682)[:1.8.045] at java.util.concurrent.ThreadPoolExecutor.runWorker(ThreadPoolExecutor.java:1142)[:1.8.045] at java.util.concurrent.ThreadPoolExecutor$Worker.run(ThreadPoolExecutor.java:617)[:1.8.045] at java.lang.Thread.run(Thread.java:745)[:1.8.045] Caused by: shaded.org.eclipse.aether.transfer.ArtifactNotFoundException: Could not find artifact org.opendaylight.aaa:features-aaa-shiro:xml:features:0.3.0-SNAPSHOT at shaded.org.eclipse.aether.internal.impl.DefaultArtifactResolver.resolve(DefaultArtifactResolver.java:434) ... 64 more 2016-01-02 09:05:53,268 | WARN | FelixShutdown | core | 75 - org.apache.aries.jmx.core - 1.1.2 | Task rejected for JMX Notification dispatch of event [org.osgi.framework.ServiceEvent[source=[javax.management.MBeanServer]]] - Dispatcher may have been shutdown Jan 02, 2016 9:05:53 AM org.ops4j.pax.exam.spi.reactors.ReactorManager afterClass INFO: suite finished Jan 02, 2016 9:05:53 AM org.opendaylight.odlparent.featuretest.PerRepoTestRunner runChild INFO: About to run test for file:/home/odldev/git/hello/features/target/classes/features.xml Jan 02, 2016 9:05:53 AM org.opendaylight.odlparent.featuretest.PerFeatureRunner run INFO: About to run test for feature: odl-hello-rest 1.0.0-SNAPSHOT Jan 02, 2016 9:05:53 AM org.ops4j.pax.exam.junit.impl.ProbeRunner run INFO: running test class org.opendaylight.odlparent.featuretest.SingleFeatureTest Jan 02, 2016 9:05:54 AM org.ops4j.pax.exam.karaf.container.internal.KarafTestContainer startKaraf INFO: Wait for test container to finish its initialization [ RelativeTimeout value = 180000 ] Jan 02, 2016 9:05:54 AM org.ops4j.pax.exam.rbc.client.intern.RemoteBundleContextClientImpl getRemoteBundleContext INFO: Waiting for remote bundle context.. on 21000 name: 36d7d572-0e2c-49df-94ed-5fa712ce360c timout: [ RelativeTimeout value = 180000 ] 2016-01-02 09:06:06,844 | INFO | ion(3)-127.0.0.1 | SingleFeatureTest | 84 - PAXEXAM-PROBE-e2caa69c-7d9d-45ff-b017-0747cfa76574 - 0.0.0 | Attempting to add repository file:/home/odldev/git/hello/features/target/classes/features.xml 2016-01-02 09:06:06,864 | INFO | ion(3)-127.0.0.1 | SingleFeatureTest | 84 - PAXEXAM-PROBE-e2caa69c-7d9d-45ff-b017-0747cfa76574 - 0.0.0 | Successfully loaded repository file:/home/odldev/git/hello/features/target/classes/features.xml 2016-01-02 09:06:06,864 | INFO | ion(3)-127.0.0.1 | SingleFeatureTest | 84 - PAXEXAM-PROBE-e2caa69c-7d9d-45ff-b017-0747cfa76574 - 0.0.0 | Attempting to install feature odl-hello-rest 1.0.0-SNAPSHOT 2016-01-02 09:06:07,145 | WARN | ion(3)-127.0.0.1 | AetherBasedResolver | 1 - org.ops4j.pax.url.mvn - 2.2.0 | Error resolving artifactorg.opendaylight.aaa:features-aaa-shiro:xml:features:0.3.0-SNAPSHOT:Could not find artifact org.opendaylight.aaa:features-aaa-shiro:xml:features:0.3.0-SNAPSHOT shaded.org.eclipse.aether.resolution.ArtifactResolutionException: Could not find artifact org.opendaylight.aaa:features-aaa-shiro:xml:features:0.3.0-SNAPSHOT at shaded.org.eclipse.aether.internal.impl.DefaultArtifactResolver.resolve(DefaultArtifactResolver.java:444) at shaded.org.eclipse.aether.internal.impl.DefaultArtifactResolver.resolveArtifacts(DefaultArtifactResolver.java:246) at shaded.org.eclipse.aether.internal.impl.DefaultArtifactResolver.resolveArtifact(DefaultArtifactResolver.java:223) at shaded.org.eclipse.aether.internal.impl.DefaultRepositorySystem.resolveArtifact(DefaultRepositorySystem.java:294) at org.ops4j.pax.url.mvn.internal.AetherBasedResolver.resolve(AetherBasedResolver.java:344) at org.ops4j.pax.url.mvn.internal.AetherBasedResolver.resolveFile(AetherBasedResolver.java:313) at org.ops4j.pax.url.mvn.internal.AetherBasedResolver.resolve(AetherBasedResolver.java:297) at org.ops4j.pax.url.mvn.internal.Connection.getInputStream(Connection.java:131) at org.apache.karaf.features.internal.FeatureValidationUtil.load(FeatureValidationUtil.java:93) at org.apache.karaf.features.internal.FeatureValidationUtil.validate(FeatureValidationUtil.java:58) at org.apache.karaf.features.internal.FeaturesServiceImpl.validateRepository(FeaturesServiceImpl.java:162) at org.apache.karaf.features.internal.FeaturesServiceImpl.internalAddRepository(FeaturesServiceImpl.java:233) at org.apache.karaf.features.internal.FeaturesServiceImpl.getFeatures(FeaturesServiceImpl.java:813) at org.apache.karaf.features.internal.FeaturesServiceImpl.getFeature(FeaturesServiceImpl.java:771) at org.apache.karaf.features.internal.FeaturesServiceImpl.installFeature(FeaturesServiceImpl.java:359) at org.apache.karaf.features.internal.FeaturesServiceImpl.installFeature(FeaturesServiceImpl.java:347) at Proxy345b036fe9724c928ad4f5c75e386f16.installFeature(Unknown Source) at org.opendaylight.odlparent.featuretest.SingleFeatureTest.installFeature(SingleFeatureTest.java:207) at sun.reflect.NativeMethodAccessorImpl.invoke0(Native Method)[:1.8.045] at sun.reflect.NativeMethodAccessorImpl.invoke(NativeMethodAccessorImpl.java:62)[:1.8.045] at sun.reflect.DelegatingMethodAccessorImpl.invoke(DelegatingMethodAccessorImpl.java:43)[:1.8.045] at java.lang.reflect.Method.invoke(Method.java:497)[:1.8.045] at org.junit.runners.model.FrameworkMethod$1.runReflectiveCall(FrameworkMethod.java:50) at org.junit.internal.runners.model.ReflectiveCallable.run(ReflectiveCallable.java:12) at org.junit.runners.model.FrameworkMethod.invokeExplosively(FrameworkMethod.java:47) at org.junit.internal.runners.statements.InvokeMethod.evaluate(InvokeMethod.java:17) at org.junit.internal.runners.statements.RunBefores.evaluate(RunBefores.java:26) at org.junit.runners.ParentRunner.runLeaf(ParentRunner.java:325) at org.junit.runners.BlockJUnit4ClassRunner.runChild(BlockJUnit4ClassRunner.java:78) at org.ops4j.pax.exam.invoker.junit.internal.ContainerTestRunner.runChild(ContainerTestRunner.java:68) at org.ops4j.pax.exam.invoker.junit.internal.ContainerTestRunner.runChild(ContainerTestRunner.java:37) at org.junit.runners.ParentRunner$3.run(ParentRunner.java:290) at org.junit.runners.ParentRunner$1.schedule(ParentRunner.java:71) at org.junit.runners.ParentRunner.runChildren(ParentRunner.java:288) at org.junit.runners.ParentRunner.access$000(ParentRunner.java:58) at org.junit.runners.ParentRunner$2.evaluate(ParentRunner.java:268) at org.junit.runners.ParentRunner.run(ParentRunner.java:363) at org.junit.runner.JUnitCore.run(JUnitCore.java:137) at org.junit.runner.JUnitCore.run(JUnitCore.java:115) at org.ops4j.pax.exam.invoker.junit.internal.JUnitProbeInvoker.invokeViaJUnit(JUnitProbeInvoker.java:124) at org.ops4j.pax.exam.invoker.junit.internal.JUnitProbeInvoker.findAndInvoke(JUnitProbeInvoker.java:97) at org.ops4j.pax.exam.invoker.junit.internal.JUnitProbeInvoker.call(JUnitProbeInvoker.java:73) at sun.reflect.NativeMethodAccessorImpl.invoke0(Native Method)[:1.8.045] at sun.reflect.NativeMethodAccessorImpl.invoke(NativeMethodAccessorImpl.java:62)[:1.8.045] at sun.reflect.DelegatingMethodAccessorImpl.invoke(DelegatingMethodAccessorImpl.java:43)[:1.8.045] at java.lang.reflect.Method.invoke(Method.java:497)[:1.8.045] at org.ops4j.pax.exam.rbc.internal.RemoteBundleContextImpl.remoteCall(RemoteBundleContextImpl.java:80) at sun.reflect.NativeMethodAccessorImpl.invoke0(Native Method)[:1.8.045] at sun.reflect.NativeMethodAccessorImpl.invoke(NativeMethodAccessorImpl.java:62)[:1.8.045] at sun.reflect.DelegatingMethodAccessorImpl.invoke(DelegatingMethodAccessorImpl.java:43)[:1.8.045] at java.lang.reflect.Method.invoke(Method.java:497)[:1.8.045] at sun.rmi.server.UnicastServerRef.dispatch(UnicastServerRef.java:323)[:1.8.045] at sun.rmi.transport.Transport$1.run(Transport.java:200)[:1.8.045] at sun.rmi.transport.Transport$1.run(Transport.java:197)[:1.8.045] at java.security.AccessController.doPrivileged(Native Method)[:1.8.045] at sun.rmi.transport.Transport.serviceCall(Transport.java:196)[:1.8.045] at sun.rmi.transport.tcp.TCPTransport.handleMessages(TCPTransport.java:568)[:1.8.045] at sun.rmi.transport.tcp.TCPTransport$ConnectionHandler.run0(TCPTransport.java:826)[:1.8.045] at sun.rmi.transport.tcp.TCPTransport$ConnectionHandler.lambda$run$241(TCPTransport.java:683)[:1.8.045] at sun.rmi.transport.tcp.TCPTransport$ConnectionHandler$$Lambda$1/800505818.run(Unknown Source) at java.security.AccessController.doPrivileged(Native Method)[:1.8.045] at sun.rmi.transport.tcp.TCPTransport$ConnectionHandler.run(TCPTransport.java:682)[:1.8.045] at java.util.concurrent.ThreadPoolExecutor.runWorker(ThreadPoolExecutor.java:1142)[:1.8.045] at java.util.concurrent.ThreadPoolExecutor$Worker.run(ThreadPoolExecutor.java:617)[:1.8.045] at java.lang.Thread.run(Thread.java:745)[:1.8.045] Caused by: shaded.org.eclipse.aether.transfer.ArtifactNotFoundException: Could not find artifact org.opendaylight.aaa:features-aaa-shiro:xml:features:0.3.0-SNAPSHOT at shaded.org.eclipse.aether.internal.impl.DefaultArtifactResolver.resolve(DefaultArtifactResolver.java:434) ... 64 more 2016-01-02 09:06:07,532 | WARN | FelixShutdown | core | 75 - org.apache.aries.jmx.core - 1.1.2 | Task rejected for JMX Notification dispatch of event [org.osgi.framework.ServiceEvent[source=[javax.management.MBeanServer]]] - Dispatcher may have been shutdown Jan 02, 2016 9:06:08 AM org.ops4j.pax.exam.spi.reactors.ReactorManager afterClass INFO: suite finished Jan 02, 2016 9:06:08 AM org.opendaylight.odlparent.featuretest.PerRepoTestRunner runChild INFO: About to run test for file:/home/odldev/git/hello/features/target/classes/features.xml Jan 02, 2016 9:06:08 AM org.opendaylight.odlparent.featuretest.PerFeatureRunner run INFO: About to run test for feature: odl-hello-ui 1.0.0-SNAPSHOT Jan 02, 2016 9:06:08 AM org.ops4j.pax.exam.junit.impl.ProbeRunner run INFO: running test class org.opendaylight.odlparent.featuretest.SingleFeatureTest Jan 02, 2016 9:06:08 AM org.ops4j.pax.exam.karaf.container.internal.KarafTestContainer startKaraf INFO: Wait for test container to finish its initialization [ RelativeTimeout value = 180000 ] Jan 02, 2016 9:06:08 AM org.ops4j.pax.exam.rbc.client.intern.RemoteBundleContextClientImpl getRemoteBundleContext INFO: Waiting for remote bundle context.. on 21000 name: 9beb90a5-10de-47ce-8ffc-13d7683b1f09 timout: [ RelativeTimeout value = 180000 ] 2016-01-02 09:06:24,127 | INFO | ion(3)-127.0.0.1 | SingleFeatureTest | 84 - PAXEXAM-PROBE-e2caa69c-7d9d-45ff-b017-0747cfa76574 - 0.0.0 | Attempting to add repository file:/home/odldev/git/hello/features/target/classes/features.xml 2016-01-02 09:06:24,278 | INFO | ion(3)-127.0.0.1 | SingleFeatureTest | 84 - PAXEXAM-PROBE-e2caa69c-7d9d-45ff-b017-0747cfa76574 - 0.0.0 | Successfully loaded repository file:/home/odldev/git/hello/features/target/classes/features.xml 2016-01-02 09:06:24,280 | INFO | ion(3)-127.0.0.1 | SingleFeatureTest | 84 - PAXEXAM-PROBE-e2caa69c-7d9d-45ff-b017-0747cfa76574 - 0.0.0 | Attempting to install feature odl-hello-ui 1.0.0-SNAPSHOT 2016-01-02 09:06:24,824 | WARN | ion(3)-127.0.0.1 | AetherBasedResolver | 1 - org.ops4j.pax.url.mvn - 2.2.0 | Error resolving artifactorg.opendaylight.aaa:features-aaa-shiro:xml:features:0.3.0-SNAPSHOT:Could not find artifact org.opendaylight.aaa:features-aaa-shiro:xml:features:0.3.0-SNAPSHOT shaded.org.eclipse.aether.resolution.ArtifactResolutionException: Could not find artifact org.opendaylight.aaa:features-aaa-shiro:xml:features:0.3.0-SNAPSHOT at shaded.org.eclipse.aether.internal.impl.DefaultArtifactResolver.resolve(DefaultArtifactResolver.java:444) at shaded.org.eclipse.aether.internal.impl.DefaultArtifactResolver.resolveArtifacts(DefaultArtifactResolver.java:246) at shaded.org.eclipse.aether.internal.impl.DefaultArtifactResolver.resolveArtifact(DefaultArtifactResolver.java:223) at shaded.org.eclipse.aether.internal.impl.DefaultRepositorySystem.resolveArtifact(DefaultRepositorySystem.java:294) at org.ops4j.pax.url.mvn.internal.AetherBasedResolver.resolve(AetherBasedResolver.java:344) at org.ops4j.pax.url.mvn.internal.AetherBasedResolver.resolveFile(AetherBasedResolver.java:313) at org.ops4j.pax.url.mvn.internal.AetherBasedResolver.resolve(AetherBasedResolver.java:297) at org.ops4j.pax.url.mvn.internal.Connection.getInputStream(Connection.java:131) at org.apache.karaf.features.internal.FeatureValidationUtil.load(FeatureValidationUtil.java:93) at org.apache.karaf.features.internal.FeatureValidationUtil.validate(FeatureValidationUtil.java:58) at org.apache.karaf.features.internal.FeaturesServiceImpl.validateRepository(FeaturesServiceImpl.java:162) at org.apache.karaf.features.internal.FeaturesServiceImpl.internalAddRepository(FeaturesServiceImpl.java:233) at org.apache.karaf.features.internal.FeaturesServiceImpl.getFeatures(FeaturesServiceImpl.java:813) at org.apache.karaf.features.internal.FeaturesServiceImpl.getFeature(FeaturesServiceImpl.java:771) at org.apache.karaf.features.internal.FeaturesServiceImpl.installFeature(FeaturesServiceImpl.java:359) at org.apache.karaf.features.internal.FeaturesServiceImpl.installFeature(FeaturesServiceImpl.java:347) at Proxyc3a10f39e0c1426fa80b4c32b1e260f0.installFeature(Unknown Source) at org.opendaylight.odlparent.featuretest.SingleFeatureTest.installFeature(SingleFeatureTest.java:207) at sun.reflect.NativeMethodAccessorImpl.invoke0(Native Method)[:1.8.045] at sun.reflect.NativeMethodAccessorImpl.invoke(NativeMethodAccessorImpl.java:62)[:1.8.045] at sun.reflect.DelegatingMethodAccessorImpl.invoke(DelegatingMethodAccessorImpl.java:43)[:1.8.045] at java.lang.reflect.Method.invoke(Method.java:497)[:1.8.045] at org.junit.runners.model.FrameworkMethod$1.runReflectiveCall(FrameworkMethod.java:50) at org.junit.internal.runners.model.ReflectiveCallable.run(ReflectiveCallable.java:12) at org.junit.runners.model.FrameworkMethod.invokeExplosively(FrameworkMethod.java:47) at org.junit.internal.runners.statements.InvokeMethod.evaluate(InvokeMethod.java:17) at org.junit.internal.runners.statements.RunBefores.evaluate(RunBefores.java:26) at org.junit.runners.ParentRunner.runLeaf(ParentRunner.java:325) at org.junit.runners.BlockJUnit4ClassRunner.runChild(BlockJUnit4ClassRunner.java:78) at org.ops4j.pax.exam.invoker.junit.internal.ContainerTestRunner.runChild(ContainerTestRunner.java:68) at org.ops4j.pax.exam.invoker.junit.internal.ContainerTestRunner.runChild(ContainerTestRunner.java:37) at org.junit.runners.ParentRunner$3.run(ParentRunner.java:290) at org.junit.runners.ParentRunner$1.schedule(ParentRunner.java:71) at org.junit.runners.ParentRunner.runChildren(ParentRunner.java:288) at org.junit.runners.ParentRunner.access$000(ParentRunner.java:58) at org.junit.runners.ParentRunner$2.evaluate(ParentRunner.java:268) at org.junit.runners.ParentRunner.run(ParentRunner.java:363) at org.junit.runner.JUnitCore.run(JUnitCore.java:137) at org.junit.runner.JUnitCore.run(JUnitCore.java:115) at org.ops4j.pax.exam.invoker.junit.internal.JUnitProbeInvoker.invokeViaJUnit(JUnitProbeInvoker.java:124) at org.ops4j.pax.exam.invoker.junit.internal.JUnitProbeInvoker.findAndInvoke(JUnitProbeInvoker.java:97) at org.ops4j.pax.exam.invoker.junit.internal.JUnitProbeInvoker.call(JUnitProbeInvoker.java:73) at sun.reflect.NativeMethodAccessorImpl.invoke0(Native Method)[:1.8.045] at sun.reflect.NativeMethodAccessorImpl.invoke(NativeMethodAccessorImpl.java:62)[:1.8.045] at sun.reflect.DelegatingMethodAccessorImpl.invoke(DelegatingMethodAccessorImpl.java:43)[:1.8.045] at java.lang.reflect.Method.invoke(Method.java:497)[:1.8.045] at org.ops4j.pax.exam.rbc.internal.RemoteBundleContextImpl.remoteCall(RemoteBundleContextImpl.java:80) at sun.reflect.NativeMethodAccessorImpl.invoke0(Native Method)[:1.8.045] at sun.reflect.NativeMethodAccessorImpl.invoke(NativeMethodAccessorImpl.java:62)[:1.8.045] at sun.reflect.DelegatingMethodAccessorImpl.invoke(DelegatingMethodAccessorImpl.java:43)[:1.8.045] at java.lang.reflect.Method.invoke(Method.java:497)[:1.8.045] at sun.rmi.server.UnicastServerRef.dispatch(UnicastServerRef.java:323)[:1.8.045] at sun.rmi.transport.Transport$1.run(Transport.java:200)[:1.8.045] at sun.rmi.transport.Transport$1.run(Transport.java:197)[:1.8.045] at java.security.AccessController.doPrivileged(Native Method)[:1.8.045] at sun.rmi.transport.Transport.serviceCall(Transport.java:196)[:1.8.045] at sun.rmi.transport.tcp.TCPTransport.handleMessages(TCPTransport.java:568)[:1.8.045] at sun.rmi.transport.tcp.TCPTransport$ConnectionHandler.run0(TCPTransport.java:826)[:1.8.045] at sun.rmi.transport.tcp.TCPTransport$ConnectionHandler.lambda$run$241(TCPTransport.java:683)[:1.8.045] at sun.rmi.transport.tcp.TCPTransport$ConnectionHandler$$Lambda$1/722776432.run(Unknown Source) at java.security.AccessController.doPrivileged(Native Method)[:1.8.045] at sun.rmi.transport.tcp.TCPTransport$ConnectionHandler.run(TCPTransport.java:682)[:1.8.045] at java.util.concurrent.ThreadPoolExecutor.runWorker(ThreadPoolExecutor.java:1142)[:1.8.045] at java.util.concurrent.ThreadPoolExecutor$Worker.run(ThreadPoolExecutor.java:617)[:1.8.045] at java.lang.Thread.run(Thread.java:745)[:1.8.045] Caused by: shaded.org.eclipse.aether.transfer.ArtifactNotFoundException: Could not find artifact org.opendaylight.aaa:features-aaa-shiro:xml:features:0.3.0-SNAPSHOT at shaded.org.eclipse.aether.internal.impl.DefaultArtifactResolver.resolve(DefaultArtifactResolver.java:434) ... 64 more 2016-01-02 09:06:26,256 | WARN | FelixShutdown | core | 75 - org.apache.aries.jmx.core - 1.1.2 | Task rejected for JMX Notification dispatch of event [org.osgi.framework.ServiceEvent[source=[javax.management.MBeanServer]]] - Dispatcher may have been shutdown Jan 02, 2016 9:06:26 AM org.ops4j.pax.exam.spi.reactors.ReactorManager afterClass INFO: suite finished Tests run: 4, Failures: 0, Errors: 4, Skipped: 0, Time elapsed: 64.817 sec <<< FAILURE! - in org.opendaylight.odlparent.featuretest.SingleFeatureTest installFeature(org.opendaylight.odlparent.featuretest.SingleFeatureTest)[repoUrl: file:/home/odldev/git/hello/features/target/classes/features.xml, Feature: odl-hello-api 1.0.0-SNAPSHOT] Time elapsed: 20.059 sec <<< ERROR! java.io.IOException: Error resolving artifact org.opendaylight.aaa:features-aaa-shiro:xml:features:0.3.0-SNAPSHOT: Could not find artifact org.opendaylight.aaa:features-aaa-shiro:xml:features:0.3.0-SNAPSHOT at org.ops4j.pax.url.mvn.internal.AetherBasedResolver.resolve(AetherBasedResolver.java:355) at org.ops4j.pax.url.mvn.internal.AetherBasedResolver.resolveFile(AetherBasedResolver.java:313) at org.ops4j.pax.url.mvn.internal.AetherBasedResolver.resolve(AetherBasedResolver.java:297) at org.ops4j.pax.url.mvn.internal.Connection.getInputStream(Connection.java:131) at org.apache.karaf.features.internal.FeatureValidationUtil.load(FeatureValidationUtil.java:93) at org.apache.karaf.features.internal.FeatureValidationUtil.validate(FeatureValidationUtil.java:58) at org.apache.karaf.features.internal.FeaturesServiceImpl.validateRepository(FeaturesServiceImpl.java:162) at org.apache.karaf.features.internal.FeaturesServiceImpl.internalAddRepository(FeaturesServiceImpl.java:233) at org.apache.karaf.features.internal.FeaturesServiceImpl.getFeatures(FeaturesServiceImpl.java:813) at org.apache.karaf.features.internal.FeaturesServiceImpl.getFeature(FeaturesServiceImpl.java:771) at org.apache.karaf.features.internal.FeaturesServiceImpl.installFeature(FeaturesServiceImpl.java:359) at org.apache.karaf.features.internal.FeaturesServiceImpl.installFeature(FeaturesServiceImpl.java:347) at Proxy7e73e05b6bf2437e9eff189d0f002f62.installFeature(Unknown Source) at org.opendaylight.odlparent.featuretest.SingleFeatureTest.installFeature(SingleFeatureTest.java:207) at sun.reflect.NativeMethodAccessorImpl.invoke0(Native Method) at sun.reflect.NativeMethodAccessorImpl.invoke(NativeMethodAccessorImpl.java:62) at sun.reflect.DelegatingMethodAccessorImpl.invoke(DelegatingMethodAccessorImpl.java:43) at java.lang.reflect.Method.invoke(Method.java:497) at org.junit.runners.model.FrameworkMethod$1.runReflectiveCall(FrameworkMethod.java:50) at org.junit.internal.runners.model.ReflectiveCallable.run(ReflectiveCallable.java:12) at org.junit.runners.model.FrameworkMethod.invokeExplosively(FrameworkMethod.java:47) at org.junit.internal.runners.statements.InvokeMethod.evaluate(InvokeMethod.java:17) at org.junit.internal.runners.statements.RunBefores.evaluate(RunBefores.java:26) at org.junit.runners.ParentRunner.runLeaf(ParentRunner.java:325) at org.junit.runners.BlockJUnit4ClassRunner.runChild(BlockJUnit4ClassRunner.java:78) at org.ops4j.pax.exam.invoker.junit.internal.ContainerTestRunner.runChild(ContainerTestRunner.java:68) at org.ops4j.pax.exam.invoker.junit.internal.ContainerTestRunner.runChild(ContainerTestRunner.java:37) at org.junit.runners.ParentRunner$3.run(ParentRunner.java:290) at org.junit.runners.ParentRunner$1.schedule(ParentRunner.java:71) at org.junit.runners.ParentRunner.runChildren(ParentRunner.java:288) at org.junit.runners.ParentRunner.access$000(ParentRunner.java:58) at org.junit.runners.ParentRunner$2.evaluate(ParentRunner.java:268) at org.junit.runners.ParentRunner.run(ParentRunner.java:363) at org.junit.runner.JUnitCore.run(JUnitCore.java:137) at org.junit.runner.JUnitCore.run(JUnitCore.java:115) at org.ops4j.pax.exam.invoker.junit.internal.JUnitProbeInvoker.invokeViaJUnit(JUnitProbeInvoker.java:124) at org.ops4j.pax.exam.invoker.junit.internal.JUnitProbeInvoker.findAndInvoke(JUnitProbeInvoker.java:97) at org.ops4j.pax.exam.invoker.junit.internal.JUnitProbeInvoker.call(JUnitProbeInvoker.java:73) at sun.reflect.NativeMethodAccessorImpl.invoke0(Native Method) at sun.reflect.NativeMethodAccessorImpl.invoke(NativeMethodAccessorImpl.java:62) at sun.reflect.DelegatingMethodAccessorImpl.invoke(DelegatingMethodAccessorImpl.java:43) at java.lang.reflect.Method.invoke(Method.java:497) at org.ops4j.pax.exam.rbc.internal.RemoteBundleContextImpl.remoteCall(RemoteBundleContextImpl.java:80) at sun.reflect.NativeMethodAccessorImpl.invoke0(Native Method) at sun.reflect.NativeMethodAccessorImpl.invoke(NativeMethodAccessorImpl.java:62) at sun.reflect.DelegatingMethodAccessorImpl.invoke(DelegatingMethodAccessorImpl.java:43) at java.lang.reflect.Method.invoke(Method.java:497) at sun.rmi.server.UnicastServerRef.dispatch(UnicastServerRef.java:323) at sun.rmi.transport.Transport$1.run(Transport.java:200) at sun.rmi.transport.Transport$1.run(Transport.java:197) at java.security.AccessController.doPrivileged(Native Method) at sun.rmi.transport.Transport.serviceCall(Transport.java:196) at sun.rmi.transport.tcp.TCPTransport.handleMessages(TCPTransport.java:568) at sun.rmi.transport.tcp.TCPTransport$ConnectionHandler.run0(TCPTransport.java:826) at sun.rmi.transport.tcp.TCPTransport$ConnectionHandler.lambda$run$241(TCPTransport.java:683) at sun.rmi.transport.tcp.TCPTransport$ConnectionHandler$$Lambda$1/1292811496.run(Unknown Source) at java.security.AccessController.doPrivileged(Native Method) at sun.rmi.transport.tcp.TCPTransport$ConnectionHandler.run(TCPTransport.java:682) at java.util.concurrent.ThreadPoolExecutor.runWorker(ThreadPoolExecutor.java:1142) at java.util.concurrent.ThreadPoolExecutor$Worker.run(ThreadPoolExecutor.java:617) at java.lang.Thread.run(Thread.java:745)

installFeature(org.opendaylight.odlparent.featuretest.SingleFeatureTest)[repoUrl: file:/home/odldev/git/hello/features/target/classes/features.xml, Feature: odl-hello 1.0.0-SNAPSHOT] Time elapsed: 11.411 sec <<< ERROR! java.io.IOException: Error resolving artifact org.opendaylight.aaa:features-aaa-shiro:xml:features:0.3.0-SNAPSHOT: Could not find artifact org.opendaylight.aaa:features-aaa-shiro:xml:features:0.3.0-SNAPSHOT at org.ops4j.pax.url.mvn.internal.AetherBasedResolver.resolve(AetherBasedResolver.java:355) at org.ops4j.pax.url.mvn.internal.AetherBasedResolver.resolveFile(AetherBasedResolver.java:313) at org.ops4j.pax.url.mvn.internal.AetherBasedResolver.resolve(AetherBasedResolver.java:297) at org.ops4j.pax.url.mvn.internal.Connection.getInputStream(Connection.java:131) at org.apache.karaf.features.internal.FeatureValidationUtil.load(FeatureValidationUtil.java:93) at org.apache.karaf.features.internal.FeatureValidationUtil.validate(FeatureValidationUtil.java:58) at org.apache.karaf.features.internal.FeaturesServiceImpl.validateRepository(FeaturesServiceImpl.java:162) at org.apache.karaf.features.internal.FeaturesServiceImpl.internalAddRepository(FeaturesServiceImpl.java:233) at org.apache.karaf.features.internal.FeaturesServiceImpl.getFeatures(FeaturesServiceImpl.java:813) at org.apache.karaf.features.internal.FeaturesServiceImpl.getFeature(FeaturesServiceImpl.java:771) at org.apache.karaf.features.internal.FeaturesServiceImpl.installFeature(FeaturesServiceImpl.java:359) at org.apache.karaf.features.internal.FeaturesServiceImpl.installFeature(FeaturesServiceImpl.java:347) at Proxy8e3ebab468b24ee9aa60a6c7c22d1e8a.installFeature(Unknown Source) at org.opendaylight.odlparent.featuretest.SingleFeatureTest.installFeature(SingleFeatureTest.java:207) at sun.reflect.NativeMethodAccessorImpl.invoke0(Native Method) at sun.reflect.NativeMethodAccessorImpl.invoke(NativeMethodAccessorImpl.java:62) at sun.reflect.DelegatingMethodAccessorImpl.invoke(DelegatingMethodAccessorImpl.java:43) at java.lang.reflect.Method.invoke(Method.java:497) at org.junit.runners.model.FrameworkMethod$1.runReflectiveCall(FrameworkMethod.java:50) at org.junit.internal.runners.model.ReflectiveCallable.run(ReflectiveCallable.java:12) at org.junit.runners.model.FrameworkMethod.invokeExplosively(FrameworkMethod.java:47) at org.junit.internal.runners.statements.InvokeMethod.evaluate(InvokeMethod.java:17) at org.junit.internal.runners.statements.RunBefores.evaluate(RunBefores.java:26) at org.junit.runners.ParentRunner.runLeaf(ParentRunner.java:325) at org.junit.runners.BlockJUnit4ClassRunner.runChild(BlockJUnit4ClassRunner.java:78) at org.ops4j.pax.exam.invoker.junit.internal.ContainerTestRunner.runChild(ContainerTestRunner.java:68) at org.ops4j.pax.exam.invoker.junit.internal.ContainerTestRunner.runChild(ContainerTestRunner.java:37) at org.junit.runners.ParentRunner$3.run(ParentRunner.java:290) at org.junit.runners.ParentRunner$1.schedule(ParentRunner.java:71) at org.junit.runners.ParentRunner.runChildren(ParentRunner.java:288) at org.junit.runners.ParentRunner.access$000(ParentRunner.java:58) at org.junit.runners.ParentRunner$2.evaluate(ParentRunner.java:268) at org.junit.runners.ParentRunner.run(ParentRunner.java:363) at org.junit.runner.JUnitCore.run(JUnitCore.java:137) at org.junit.runner.JUnitCore.run(JUnitCore.java:115) at org.ops4j.pax.exam.invoker.junit.internal.JUnitProbeInvoker.invokeViaJUnit(JUnitProbeInvoker.java:124) at org.ops4j.pax.exam.invoker.junit.internal.JUnitProbeInvoker.findAndInvoke(JUnitProbeInvoker.java:97) at org.ops4j.pax.exam.invoker.junit.internal.JUnitProbeInvoker.call(JUnitProbeInvoker.java:73) at sun.reflect.NativeMethodAccessorImpl.invoke0(Native Method) at sun.reflect.NativeMethodAccessorImpl.invoke(NativeMethodAccessorImpl.java:62) at sun.reflect.DelegatingMethodAccessorImpl.invoke(DelegatingMethodAccessorImpl.java:43) at java.lang.reflect.Method.invoke(Method.java:497) at org.ops4j.pax.exam.rbc.internal.RemoteBundleContextImpl.remoteCall(RemoteBundleContextImpl.java:80) at sun.reflect.NativeMethodAccessorImpl.invoke0(Native Method) at sun.reflect.NativeMethodAccessorImpl.invoke(NativeMethodAccessorImpl.java:62) at sun.reflect.DelegatingMethodAccessorImpl.invoke(DelegatingMethodAccessorImpl.java:43) at java.lang.reflect.Method.invoke(Method.java:497) at sun.rmi.server.UnicastServerRef.dispatch(UnicastServerRef.java:323) at sun.rmi.transport.Transport$1.run(Transport.java:200) at sun.rmi.transport.Transport$1.run(Transport.java:197) at java.security.AccessController.doPrivileged(Native Method) at sun.rmi.transport.Transport.serviceCall(Transport.java:196) at sun.rmi.transport.tcp.TCPTransport.handleMessages(TCPTransport.java:568) at sun.rmi.transport.tcp.TCPTransport$ConnectionHandler.run0(TCPTransport.java:826) at sun.rmi.transport.tcp.TCPTransport$ConnectionHandler.lambda$run$241(TCPTransport.java:683) at sun.rmi.transport.tcp.TCPTransport$ConnectionHandler$$Lambda$1/590623838.run(Unknown Source) at java.security.AccessController.doPrivileged(Native Method) at sun.rmi.transport.tcp.TCPTransport$ConnectionHandler.run(TCPTransport.java:682) at java.util.concurrent.ThreadPoolExecutor.runWorker(ThreadPoolExecutor.java:1142) at java.util.concurrent.ThreadPoolExecutor$Worker.run(ThreadPoolExecutor.java:617) at java.lang.Thread.run(Thread.java:745)

installFeature(org.opendaylight.odlparent.featuretest.SingleFeatureTest)[repoUrl: file:/home/odldev/git/hello/features/target/classes/features.xml, Feature: odl-hello-rest 1.0.0-SNAPSHOT] Time elapsed: 14.23 sec <<< ERROR! java.io.IOException: Error resolving artifact org.opendaylight.aaa:features-aaa-shiro:xml:features:0.3.0-SNAPSHOT: Could not find artifact org.opendaylight.aaa:features-aaa-shiro:xml:features:0.3.0-SNAPSHOT at org.ops4j.pax.url.mvn.internal.AetherBasedResolver.resolve(AetherBasedResolver.java:355) at org.ops4j.pax.url.mvn.internal.AetherBasedResolver.resolveFile(AetherBasedResolver.java:313) at org.ops4j.pax.url.mvn.internal.AetherBasedResolver.resolve(AetherBasedResolver.java:297) at org.ops4j.pax.url.mvn.internal.Connection.getInputStream(Connection.java:131) at org.apache.karaf.features.internal.FeatureValidationUtil.load(FeatureValidationUtil.java:93) at org.apache.karaf.features.internal.FeatureValidationUtil.validate(FeatureValidationUtil.java:58) at org.apache.karaf.features.internal.FeaturesServiceImpl.validateRepository(FeaturesServiceImpl.java:162) at org.apache.karaf.features.internal.FeaturesServiceImpl.internalAddRepository(FeaturesServiceImpl.java:233) at org.apache.karaf.features.internal.FeaturesServiceImpl.getFeatures(FeaturesServiceImpl.java:813) at org.apache.karaf.features.internal.FeaturesServiceImpl.getFeature(FeaturesServiceImpl.java:771) at org.apache.karaf.features.internal.FeaturesServiceImpl.installFeature(FeaturesServiceImpl.java:359) at org.apache.karaf.features.internal.FeaturesServiceImpl.installFeature(FeaturesServiceImpl.java:347) at Proxy345b036fe9724c928ad4f5c75e386f16.installFeature(Unknown Source) at org.opendaylight.odlparent.featuretest.SingleFeatureTest.installFeature(SingleFeatureTest.java:207) at sun.reflect.NativeMethodAccessorImpl.invoke0(Native Method) at sun.reflect.NativeMethodAccessorImpl.invoke(NativeMethodAccessorImpl.java:62) at sun.reflect.DelegatingMethodAccessorImpl.invoke(DelegatingMethodAccessorImpl.java:43) at java.lang.reflect.Method.invoke(Method.java:497) at org.junit.runners.model.FrameworkMethod$1.runReflectiveCall(FrameworkMethod.java:50) at org.junit.internal.runners.model.ReflectiveCallable.run(ReflectiveCallable.java:12) at org.junit.runners.model.FrameworkMethod.invokeExplosively(FrameworkMethod.java:47) at org.junit.internal.runners.statements.InvokeMethod.evaluate(InvokeMethod.java:17) at org.junit.internal.runners.statements.RunBefores.evaluate(RunBefores.java:26) at org.junit.runners.ParentRunner.runLeaf(ParentRunner.java:325) at org.junit.runners.BlockJUnit4ClassRunner.runChild(BlockJUnit4ClassRunner.java:78) at org.ops4j.pax.exam.invoker.junit.internal.ContainerTestRunner.runChild(ContainerTestRunner.java:68) at org.ops4j.pax.exam.invoker.junit.internal.ContainerTestRunner.runChild(ContainerTestRunner.java:37) at org.junit.runners.ParentRunner$3.run(ParentRunner.java:290) at org.junit.runners.ParentRunner$1.schedule(ParentRunner.java:71) at org.junit.runners.ParentRunner.runChildren(ParentRunner.java:288) at org.junit.runners.ParentRunner.access$000(ParentRunner.java:58) at org.junit.runners.ParentRunner$2.evaluate(ParentRunner.java:268) at org.junit.runners.ParentRunner.run(ParentRunner.java:363) at org.junit.runner.JUnitCore.run(JUnitCore.java:137) at org.junit.runner.JUnitCore.run(JUnitCore.java:115) at org.ops4j.pax.exam.invoker.junit.internal.JUnitProbeInvoker.invokeViaJUnit(JUnitProbeInvoker.java:124) at org.ops4j.pax.exam.invoker.junit.internal.JUnitProbeInvoker.findAndInvoke(JUnitProbeInvoker.java:97) at org.ops4j.pax.exam.invoker.junit.internal.JUnitProbeInvoker.call(JUnitProbeInvoker.java:73) at sun.reflect.NativeMethodAccessorImpl.invoke0(Native Method) at sun.reflect.NativeMethodAccessorImpl.invoke(NativeMethodAccessorImpl.java:62) at sun.reflect.DelegatingMethodAccessorImpl.invoke(DelegatingMethodAccessorImpl.java:43) at java.lang.reflect.Method.invoke(Method.java:497) at org.ops4j.pax.exam.rbc.internal.RemoteBundleContextImpl.remoteCall(RemoteBundleContextImpl.java:80) at sun.reflect.NativeMethodAccessorImpl.invoke0(Native Method) at sun.reflect.NativeMethodAccessorImpl.invoke(NativeMethodAccessorImpl.java:62) at sun.reflect.DelegatingMethodAccessorImpl.invoke(DelegatingMethodAccessorImpl.java:43) at java.lang.reflect.Method.invoke(Method.java:497) at sun.rmi.server.UnicastServerRef.dispatch(UnicastServerRef.java:323) at sun.rmi.transport.Transport$1.run(Transport.java:200) at sun.rmi.transport.Transport$1.run(Transport.java:197) at java.security.AccessController.doPrivileged(Native Method) at sun.rmi.transport.Transport.serviceCall(Transport.java:196) at sun.rmi.transport.tcp.TCPTransport.handleMessages(TCPTransport.java:568) at sun.rmi.transport.tcp.TCPTransport$ConnectionHandler.run0(TCPTransport.java:826) at sun.rmi.transport.tcp.TCPTransport$ConnectionHandler.lambda$run$241(TCPTransport.java:683) at sun.rmi.transport.tcp.TCPTransport$ConnectionHandler$$Lambda$1/800505818.run(Unknown Source) at java.security.AccessController.doPrivileged(Native Method) at sun.rmi.transport.tcp.TCPTransport$ConnectionHandler.run(TCPTransport.java:682) at java.util.concurrent.ThreadPoolExecutor.runWorker(ThreadPoolExecutor.java:1142) at java.util.concurrent.ThreadPoolExecutor$Worker.run(ThreadPoolExecutor.java:617) at java.lang.Thread.run(Thread.java:745)

installFeature(org.opendaylight.odlparent.featuretest.SingleFeatureTest)[repoUrl: file:/home/odldev/git/hello/features/target/classes/features.xml, Feature: odl-hello-ui 1.0.0-SNAPSHOT] Time elapsed: 18.777 sec <<< ERROR! java.io.IOException: Error resolving artifact org.opendaylight.aaa:features-aaa-shiro:xml:features:0.3.0-SNAPSHOT: Could not find artifact org.opendaylight.aaa:features-aaa-shiro:xml:features:0.3.0-SNAPSHOT at org.ops4j.pax.url.mvn.internal.AetherBasedResolver.resolve(AetherBasedResolver.java:355) at org.ops4j.pax.url.mvn.internal.AetherBasedResolver.resolveFile(AetherBasedResolver.java:313) at org.ops4j.pax.url.mvn.internal.AetherBasedResolver.resolve(AetherBasedResolver.java:297) at org.ops4j.pax.url.mvn.internal.Connection.getInputStream(Connection.java:131) at org.apache.karaf.features.internal.FeatureValidationUtil.load(FeatureValidationUtil.java:93) at org.apache.karaf.features.internal.FeatureValidationUtil.validate(FeatureValidationUtil.java:58) at org.apache.karaf.features.internal.FeaturesServiceImpl.validateRepository(FeaturesServiceImpl.java:162) at org.apache.karaf.features.internal.FeaturesServiceImpl.internalAddRepository(FeaturesServiceImpl.java:233) at org.apache.karaf.features.internal.FeaturesServiceImpl.getFeatures(FeaturesServiceImpl.java:813) at org.apache.karaf.features.internal.FeaturesServiceImpl.getFeature(FeaturesServiceImpl.java:771) at org.apache.karaf.features.internal.FeaturesServiceImpl.installFeature(FeaturesServiceImpl.java:359) at org.apache.karaf.features.internal.FeaturesServiceImpl.installFeature(FeaturesServiceImpl.java:347) at Proxyc3a10f39e0c1426fa80b4c32b1e260f0.installFeature(Unknown Source) at org.opendaylight.odlparent.featuretest.SingleFeatureTest.installFeature(SingleFeatureTest.java:207) at sun.reflect.NativeMethodAccessorImpl.invoke0(Native Method) at sun.reflect.NativeMethodAccessorImpl.invoke(NativeMethodAccessorImpl.java:62) at sun.reflect.DelegatingMethodAccessorImpl.invoke(DelegatingMethodAccessorImpl.java:43) at java.lang.reflect.Method.invoke(Method.java:497) at org.junit.runners.model.FrameworkMethod$1.runReflectiveCall(FrameworkMethod.java:50) at org.junit.internal.runners.model.ReflectiveCallable.run(ReflectiveCallable.java:12) at org.junit.runners.model.FrameworkMethod.invokeExplosively(FrameworkMethod.java:47) at org.junit.internal.runners.statements.InvokeMethod.evaluate(InvokeMethod.java:17) at org.junit.internal.runners.statements.RunBefores.evaluate(RunBefores.java:26) at org.junit.runners.ParentRunner.runLeaf(ParentRunner.java:325) at org.junit.runners.BlockJUnit4ClassRunner.runChild(BlockJUnit4ClassRunner.java:78) at org.ops4j.pax.exam.invoker.junit.internal.ContainerTestRunner.runChild(ContainerTestRunner.java:68) at org.ops4j.pax.exam.invoker.junit.internal.ContainerTestRunner.runChild(ContainerTestRunner.java:37) at org.junit.runners.ParentRunner$3.run(ParentRunner.java:290) at org.junit.runners.ParentRunner$1.schedule(ParentRunner.java:71) at org.junit.runners.ParentRunner.runChildren(ParentRunner.java:288) at org.junit.runners.ParentRunner.access$000(ParentRunner.java:58) at org.junit.runners.ParentRunner$2.evaluate(ParentRunner.java:268) at org.junit.runners.ParentRunner.run(ParentRunner.java:363) at org.junit.runner.JUnitCore.run(JUnitCore.java:137) at org.junit.runner.JUnitCore.run(JUnitCore.java:115) at org.ops4j.pax.exam.invoker.junit.internal.JUnitProbeInvoker.invokeViaJUnit(JUnitProbeInvoker.java:124) at org.ops4j.pax.exam.invoker.junit.internal.JUnitProbeInvoker.findAndInvoke(JUnitProbeInvoker.java:97) at org.ops4j.pax.exam.invoker.junit.internal.JUnitProbeInvoker.call(JUnitProbeInvoker.java:73) at sun.reflect.NativeMethodAccessorImpl.invoke0(Native Method) at sun.reflect.NativeMethodAccessorImpl.invoke(NativeMethodAccessorImpl.java:62) at sun.reflect.DelegatingMethodAccessorImpl.invoke(DelegatingMethodAccessorImpl.java:43) at java.lang.reflect.Method.invoke(Method.java:497) at org.ops4j.pax.exam.rbc.internal.RemoteBundleContextImpl.remoteCall(RemoteBundleContextImpl.java:80) at sun.reflect.NativeMethodAccessorImpl.invoke0(Native Method) at sun.reflect.NativeMethodAccessorImpl.invoke(NativeMethodAccessorImpl.java:62) at sun.reflect.DelegatingMethodAccessorImpl.invoke(DelegatingMethodAccessorImpl.java:43) at java.lang.reflect.Method.invoke(Method.java:497) at sun.rmi.server.UnicastServerRef.dispatch(UnicastServerRef.java:323) at sun.rmi.transport.Transport$1.run(Transport.java:200) at sun.rmi.transport.Transport$1.run(Transport.java:197) at java.security.AccessController.doPrivileged(Native Method) at sun.rmi.transport.Transport.serviceCall(Transport.java:196) at sun.rmi.transport.tcp.TCPTransport.handleMessages(TCPTransport.java:568) at sun.rmi.transport.tcp.TCPTransport$ConnectionHandler.run0(TCPTransport.java:826) at sun.rmi.transport.tcp.TCPTransport$ConnectionHandler.lambda$run$241(TCPTransport.java:683) at sun.rmi.transport.tcp.TCPTransport$ConnectionHandler$$Lambda$1/722776432.run(Unknown Source) at java.security.AccessController.doPrivileged(Native Method) at sun.rmi.transport.tcp.TCPTransport$ConnectionHandler.run(TCPTransport.java:682) at java.util.concurrent.ThreadPoolExecutor.runWorker(ThreadPoolExecutor.java:1142) at java.util.concurrent.ThreadPoolExecutor$Worker.run(ThreadPoolExecutor.java:617) at java.lang.Thread.run(Thread.java:745)

Results :

Tests in error: Error resolving artifact org.opendaylight.aaa:features-aaa-shiro:xml:features:0.3.0-SNAPSHOT: Could not find artifact org.opendaylight.aaa:features-aaa-shiro:xml:features:0.3.0-SNAPSHOT Error resolving artifact org.opendaylight.aaa:features-aaa-shiro:xml:features:0.3.0-SNAPSHOT: Could not find artifact org.opendaylight.aaa:features-aaa-shiro:xml:features:0.3.0-SNAPSHOT Error resolving artifact org.opendaylight.aaa:features-aaa-shiro:xml:features:0.3.0-SNAPSHOT: Could not find artifact org.opendaylight.aaa:features-aaa-shiro:xml:features:0.3.0-SNAPSHOT Error resolving artifact org.opendaylight.aaa:features-aaa-shiro:xml:features:0.3.0-SNAPSHOT: Could not find artifact org.opendaylight.aaa:features-aaa-shiro:xml:features:0.3.0-SNAPSHOT

Tests run: 4, Failures: 0, Errors: 4, Skipped: 0

[INFO] ------------------------------------------------------------------------ [INFO] Reactor Summary: [INFO] [INFO] hello-api .......................................... SUCCESS [ 23.109 s] [INFO] hello-impl ......................................... SUCCESS [ 17.715 s] [INFO] hello-features ..................................... FAILURE [01:29 min] [INFO] hello-karaf ........................................ SKIPPED [INFO] hello-artifacts .................................... SKIPPED [INFO] hello-it ........................................... SKIPPED [INFO] hello .............................................. SKIPPED [INFO] ------------------------------------------------------------------------ [INFO] BUILD FAILURE [INFO] ------------------------------------------------------------------------ [INFO] Total time: 02:22 min [INFO] Finished at: 2016-01-02T09:06:27+00:00 [INFO] Final Memory: 98M/794M [INFO] ------------------------------------------------------------------------ [ERROR] Failed to execute goal org.apache.maven.plugins:maven-surefire-plugin:2.18:test (default-test) on project hello-features: There are test failures. [ERROR] [ERROR] Please refer to /home/odldev/git/hello/features/target/surefire-reports for the individual test results. [ERROR] -> [Help 1] [ERROR] [ERROR] To see the full stack trace of the errors, re-run Maven with the -e switch. [ERROR] Re-run Maven using the -X switch to enable full debug logging. [ERROR] [ERROR] For more information about the errors and possible solutions, please read the following articles: [ERROR] [Help 1] http://cwiki.apache.org/confluence/display/MAVEN/MojoFailureException [ERROR] [ERROR] After correcting the problems, you can resume the build with the command [ERROR] mvn <goals> -rf :hello-features odldev@ODLDev:~/git/hello$

Unable to build the hello project

Hi Folks, I was following this link to workout the hello project. But failing at Exercise 1 - "mvn -nsu clean install"[https://wiki.opendaylight.org/view/ControllerCoreFunctionalityTutorials:ApplicationDevelopment_Tutorial] with the following error.

INFO: Waiting for remote bundle context.. on 21000 name: b3909a5f-872a-43af-b896-4f4b619559e5 timout: [ RelativeTimeout value = 180000 ] 2016-01-02 09:05:40,774 | INFO | ion(3)-127.0.0.1 | SingleFeatureTest | 84 - PAXEXAM-PROBE-e2caa69c-7d9d-45ff-b017-0747cfa76574 - 0.0.0 | Attempting to add repository file:/home/odldev/git/hello/features/target/classes/features.xml 2016-01-02 09:05:40,866 | INFO | ion(3)-127.0.0.1 | SingleFeatureTest | 84 - PAXEXAM-PROBE-e2caa69c-7d9d-45ff-b017-0747cfa76574 - 0.0.0 | Successfully loaded repository file:/home/odldev/git/hello/features/target/classes/features.xml 2016-01-02 09:05:40,866 | INFO | ion(3)-127.0.0.1 | SingleFeatureTest | 84 - PAXEXAM-PROBE-e2caa69c-7d9d-45ff-b017-0747cfa76574 - 0.0.0 | Attempting to install feature odl-hello-api 1.0.0-SNAPSHOT 2016-01-02 09:05:41,269 | WARN | ion(3)-127.0.0.1 | AetherBasedResolver | 1 - org.ops4j.pax.url.mvn - 2.2.0 | Error resolving artifactorg.opendaylight.aaa:features-aaa-shiro:xml:features:0.3.0-SNAPSHOT:Could not find artifact org.opendaylight.aaa:features-aaa-shiro:xml:features:0.3.0-SNAPSHOT shaded.org.eclipse.aether.resolution.ArtifactResolutionException: Could not find artifact org.opendaylight.aaa:features-aaa-shiro:xml:features:0.3.0-SNAPSHOT at shaded.org.eclipse.aether.internal.impl.DefaultArtifactResolver.resolve(DefaultArtifactResolver.java:444) at shaded.org.eclipse.aether.internal.impl.DefaultArtifactResolver.resolveArtifacts(DefaultArtifactResolver.java:246) at shaded.org.eclipse.aether.internal.impl.DefaultArtifactResolver.resolveArtifact(DefaultArtifactResolver.java:223) at shaded.org.eclipse.aether.internal.impl.DefaultRepositorySystem.resolveArtifact(DefaultRepositorySystem.java:294) at org.ops4j.pax.url.mvn.internal.AetherBasedResolver.resolve(AetherBasedResolver.java:344) at org.ops4j.pax.url.mvn.internal.AetherBasedResolver.resolveFile(AetherBasedResolver.java:313) at org.ops4j.pax.url.mvn.internal.AetherBasedResolver.resolve(AetherBasedResolver.java:297) at org.ops4j.pax.url.mvn.internal.Connection.getInputStream(Connection.java:131) at org.apache.karaf.features.internal.FeatureValidationUtil.load(FeatureValidationUtil.java:93) at org.apache.karaf.features.internal.FeatureValidationUtil.validate(FeatureValidationUtil.java:58) at org.apache.karaf.features.internal.FeaturesServiceImpl.validateRepository(FeaturesServiceImpl.java:162) at org.apache.karaf.features.internal.FeaturesServiceImpl.internalAddRepository(FeaturesServiceImpl.java:233) at org.apache.karaf.features.internal.FeaturesServiceImpl.getFeatures(FeaturesServiceImpl.java:813) at org.apache.karaf.features.internal.FeaturesServiceImpl.getFeature(FeaturesServiceImpl.java:771) at org.apache.karaf.features.internal.FeaturesServiceImpl.installFeature(FeaturesServiceImpl.java:359) at org.apache.karaf.features.internal.FeaturesServiceImpl.installFeature(FeaturesServiceImpl.java:347) at Proxy7e73e05b6bf2437e9eff189d0f002f62.installFeature(Unknown Source) at org.opendaylight.odlparent.featuretest.SingleFeatureTest.installFeature(SingleFeatureTest.java:207) at sun.reflect.NativeMethodAccessorImpl.invoke0(Native Method)[:1.8.045] at sun.reflect.NativeMethodAccessorImpl.invoke(NativeMethodAccessorImpl.java:62)[:1.8.045] at sun.reflect.DelegatingMethodAccessorImpl.invoke(DelegatingMethodAccessorImpl.java:43)[:1.8.045] at java.lang.reflect.Method.invoke(Method.java:497)[:1.8.045] at org.junit.runners.model.FrameworkMethod$1.runReflectiveCall(FrameworkMethod.java:50) at org.junit.internal.runners.model.ReflectiveCallable.run(ReflectiveCallable.java:12) at org.junit.runners.model.FrameworkMethod.invokeExplosively(FrameworkMethod.java:47) at org.junit.internal.runners.statements.InvokeMethod.evaluate(InvokeMethod.java:17) at org.junit.internal.runners.statements.RunBefores.evaluate(RunBefores.java:26) at org.junit.runners.ParentRunner.runLeaf(ParentRunner.java:325) at org.junit.runners.BlockJUnit4ClassRunner.runChild(BlockJUnit4ClassRunner.java:78) at org.ops4j.pax.exam.invoker.junit.internal.ContainerTestRunner.runChild(ContainerTestRunner.java:68) at org.ops4j.pax.exam.invoker.junit.internal.ContainerTestRunner.runChild(ContainerTestRunner.java:37) at org.junit.runners.ParentRunner$3.run(ParentRunner.java:290) at org.junit.runners.ParentRunner$1.schedule(ParentRunner.java:71) at org.junit.runners.ParentRunner.runChildren(ParentRunner.java:288) at org.junit.runners.ParentRunner.access$000(ParentRunner.java:58) at org.junit.runners.ParentRunner$2.evaluate(ParentRunner.java:268) at org.junit.runners.ParentRunner.run(ParentRunner.java:363) at org.junit.runner.JUnitCore.run(JUnitCore.java:137) at org.junit.runner.JUnitCore.run(JUnitCore.java:115) at org.ops4j.pax.exam.invoker.junit.internal.JUnitProbeInvoker.invokeViaJUnit(JUnitProbeInvoker.java:124) at org.ops4j.pax.exam.invoker.junit.internal.JUnitProbeInvoker.findAndInvoke(JUnitProbeInvoker.java:97) at org.ops4j.pax.exam.invoker.junit.internal.JUnitProbeInvoker.call(JUnitProbeInvoker.java:73) at sun.reflect.NativeMethodAccessorImpl.invoke0(Native Method)[:1.8.045] at sun.reflect.NativeMethodAccessorImpl.invoke(NativeMethodAccessorImpl.java:62)[:1.8.045] at sun.reflect.DelegatingMethodAccessorImpl.invoke(DelegatingMethodAccessorImpl.java:43)[:1.8.045] at java.lang.reflect.Method.invoke(Method.java:497)[:1.8.045] at org.ops4j.pax.exam.rbc.internal.RemoteBundleContextImpl.remoteCall(RemoteBundleContextImpl.java:80) at sun.reflect.NativeMethodAccessorImpl.invoke0(Native Method)[:1.8.045] at sun.reflect.NativeMethodAccessorImpl.invoke(NativeMethodAccessorImpl.java:62)[:1.8.045] at sun.reflect.DelegatingMethodAccessorImpl.invoke(DelegatingMethodAccessorImpl.java:43)[:1.8.045] at java.lang.reflect.Method.invoke(Method.java:497)[:1.8.045] at sun.rmi.server.UnicastServerRef.dispatch(UnicastServerRef.java:323)[:1.8.045] at sun.rmi.transport.Transport$1.run(Transport.java:200)[:1.8.045] at sun.rmi.transport.Transport$1.run(Transport.java:197)[:1.8.045] at java.security.AccessController.doPrivileged(Native Method)[:1.8.045] at sun.rmi.transport.Transport.serviceCall(Transport.java:196)[:1.8.045] at sun.rmi.transport.tcp.TCPTransport.handleMessages(TCPTransport.java:568)[:1.8.045] at sun.rmi.transport.tcp.TCPTransport$ConnectionHandler.run0(TCPTransport.java:826)[:1.8.045] at sun.rmi.transport.tcp.TCPTransport$ConnectionHandler.lambda$run$241(TCPTransport.java:683)[:1.8.045] at sun.rmi.transport.tcp.TCPTransport$ConnectionHandler$$Lambda$1/1292811496.run(Unknown Source) at java.security.AccessController.doPrivileged(Native Method)[:1.8.045] at sun.rmi.transport.tcp.TCPTransport$ConnectionHandler.run(TCPTransport.java:682)[:1.8.045] at java.util.concurrent.ThreadPoolExecutor.runWorker(ThreadPoolExecutor.java:1142)[:1.8.045] at java.util.concurrent.ThreadPoolExecutor$Worker.run(ThreadPoolExecutor.java:617)[:1.8.045] at java.lang.Thread.run(Thread.java:745)[:1.8.045] Caused by: shaded.org.eclipse.aether.transfer.ArtifactNotFoundException: Could not find artifact org.opendaylight.aaa:features-aaa-shiro:xml:features:0.3.0-SNAPSHOT at shaded.org.eclipse.aether.internal.impl.DefaultArtifactResolver.resolve(DefaultArtifactResolver.java:434) ... 64 more 2016-01-02 09:05:41,860 | WARN | FelixShutdown | core | 75 - org.apache.aries.jmx.core - 1.1.2 | Task rejected for JMX Notification dispatch of event [org.osgi.framework.ServiceEvent[source=[javax.management.MBeanServer]]] - Dispatcher may have been shutdown Jan 02, 2016 9:05:42 AM org.ops4j.pax.exam.spi.reactors.ReactorManager afterClass INFO: suite finished Jan 02, 2016 9:05:42 AM org.opendaylight.odlparent.featuretest.PerRepoTestRunner runChild INFO: About to run test for file:/home/odldev/git/hello/features/target/classes/features.xml Jan 02, 2016 9:05:42 AM org.opendaylight.odlparent.featuretest.PerFeatureRunner run INFO: About to run test for feature: odl-hello 1.0.0-SNAPSHOT Jan 02, 2016 9:05:42 AM org.ops4j.pax.exam.junit.impl.ProbeRunner run INFO: running test class org.opendaylight.odlparent.featuretest.SingleFeatureTest Jan 02, 2016 9:05:43 AM org.ops4j.pax.exam.karaf.container.internal.KarafTestContainer startKaraf INFO: Wait for test container to finish its initialization [ RelativeTimeout value = 180000 ] Jan 02, 2016 9:05:43 AM org.ops4j.pax.exam.rbc.client.intern.RemoteBundleContextClientImpl getRemoteBundleContext INFO: Waiting for remote bundle context.. on 21000 name: 92d51f8e-859f-4f70-b74d-83041e836fb4 timout: [ RelativeTimeout value = 180000 ] 2016-01-02 09:05:52,484 | INFO | ion(3)-127.0.0.1 | SingleFeatureTest | 84 - PAXEXAM-PROBE-e2caa69c-7d9d-45ff-b017-0747cfa76574 - 0.0.0 | Attempting to add repository file:/home/odldev/git/hello/features/target/classes/features.xml 2016-01-02 09:05:52,511 | INFO | ion(3)-127.0.0.1 | SingleFeatureTest | 84 - PAXEXAM-PROBE-e2caa69c-7d9d-45ff-b017-0747cfa76574 - 0.0.0 | Successfully loaded repository file:/home/odldev/git/hello/features/target/classes/features.xml 2016-01-02 09:05:52,511 | INFO | ion(3)-127.0.0.1 | SingleFeatureTest | 84 - PAXEXAM-PROBE-e2caa69c-7d9d-45ff-b017-0747cfa76574 - 0.0.0 | Attempting to install feature odl-hello 1.0.0-SNAPSHOT 2016-01-02 09:05:52,741 | WARN | ion(3)-127.0.0.1 | AetherBasedResolver | 1 - org.ops4j.pax.url.mvn - 2.2.0 | Error resolving artifactorg.opendaylight.aaa:features-aaa-shiro:xml:features:0.3.0-SNAPSHOT:Could not find artifact org.opendaylight.aaa:features-aaa-shiro:xml:features:0.3.0-SNAPSHOT shaded.org.eclipse.aether.resolution.ArtifactResolutionException: Could not find artifact org.opendaylight.aaa:features-aaa-shiro:xml:features:0.3.0-SNAPSHOT at shaded.org.eclipse.aether.internal.impl.DefaultArtifactResolver.resolve(DefaultArtifactResolver.java:444) at shaded.org.eclipse.aether.internal.impl.DefaultArtifactResolver.resolveArtifacts(DefaultArtifactResolver.java:246) at shaded.org.eclipse.aether.internal.impl.DefaultArtifactResolver.resolveArtifact(DefaultArtifactResolver.java:223) at shaded.org.eclipse.aether.internal.impl.DefaultRepositorySystem.resolveArtifact(DefaultRepositorySystem.java:294) at org.ops4j.pax.url.mvn.internal.AetherBasedResolver.resolve(AetherBasedResolver.java:344) at org.ops4j.pax.url.mvn.internal.AetherBasedResolver.resolveFile(AetherBasedResolver.java:313) at org.ops4j.pax.url.mvn.internal.AetherBasedResolver.resolve(AetherBasedResolver.java:297) at org.ops4j.pax.url.mvn.internal.Connection.getInputStream(Connection.java:131) at org.apache.karaf.features.internal.FeatureValidationUtil.load(FeatureValidationUtil.java:93) at org.apache.karaf.features.internal.FeatureValidationUtil.validate(FeatureValidationUtil.java:58) at org.apache.karaf.features.internal.FeaturesServiceImpl.validateRepository(FeaturesServiceImpl.java:162) at org.apache.karaf.features.internal.FeaturesServiceImpl.internalAddRepository(FeaturesServiceImpl.java:233) at org.apache.karaf.features.internal.FeaturesServiceImpl.getFeatures(FeaturesServiceImpl.java:813) at org.apache.karaf.features.internal.FeaturesServiceImpl.getFeature(FeaturesServiceImpl.java:771) at org.apache.karaf.features.internal.FeaturesServiceImpl.installFeature(FeaturesServiceImpl.java:359) at org.apache.karaf.features.internal.FeaturesServiceImpl.installFeature(FeaturesServiceImpl.java:347) at Proxy8e3ebab468b24ee9aa60a6c7c22d1e8a.installFeature(Unknown Source) at org.opendaylight.odlparent.featuretest.SingleFeatureTest.installFeature(SingleFeatureTest.java:207) at sun.reflect.NativeMethodAccessorImpl.invoke0(Native Method)[:1.8.045] at sun.reflect.NativeMethodAccessorImpl.invoke(NativeMethodAccessorImpl.java:62)[:1.8.045] at sun.reflect.DelegatingMethodAccessorImpl.invoke(DelegatingMethodAccessorImpl.java:43)[:1.8.045] at java.lang.reflect.Method.invoke(Method.java:497)[:1.8.045] at org.junit.runners.model.FrameworkMethod$1.runReflectiveCall(FrameworkMethod.java:50) at org.junit.internal.runners.model.ReflectiveCallable.run(ReflectiveCallable.java:12) at org.junit.runners.model.FrameworkMethod.invokeExplosively(FrameworkMethod.java:47) at org.junit.internal.runners.statements.InvokeMethod.evaluate(InvokeMethod.java:17) at org.junit.internal.runners.statements.RunBefores.evaluate(RunBefores.java:26) at org.junit.runners.ParentRunner.runLeaf(ParentRunner.java:325) at org.junit.runners.BlockJUnit4ClassRunner.runChild(BlockJUnit4ClassRunner.java:78) at org.ops4j.pax.exam.invoker.junit.internal.ContainerTestRunner.runChild(ContainerTestRunner.java:68) at org.ops4j.pax.exam.invoker.junit.internal.ContainerTestRunner.runChild(ContainerTestRunner.java:37) at org.junit.runners.ParentRunner$3.run(ParentRunner.java:290) at org.junit.runners.ParentRunner$1.schedule(ParentRunner.java:71) at org.junit.runners.ParentRunner.runChildren(ParentRunner.java:288) at org.junit.runners.ParentRunner.access$000(ParentRunner.java:58) at org.junit.runners.ParentRunner$2.evaluate(ParentRunner.java:268) at org.junit.runners.ParentRunner.run(ParentRunner.java:363) at org.junit.runner.JUnitCore.run(JUnitCore.java:137) at org.junit.runner.JUnitCore.run(JUnitCore.java:115) at org.ops4j.pax.exam.invoker.junit.internal.JUnitProbeInvoker.invokeViaJUnit(JUnitProbeInvoker.java:124) at org.ops4j.pax.exam.invoker.junit.internal.JUnitProbeInvoker.findAndInvoke(JUnitProbeInvoker.java:97) at org.ops4j.pax.exam.invoker.junit.internal.JUnitProbeInvoker.call(JUnitProbeInvoker.java:73) at sun.reflect.NativeMethodAccessorImpl.invoke0(Native Method)[:1.8.045] at sun.reflect.NativeMethodAccessorImpl.invoke(NativeMethodAccessorImpl.java:62)[:1.8.045] at sun.reflect.DelegatingMethodAccessorImpl.invoke(DelegatingMethodAccessorImpl.java:43)[:1.8.045] at java.lang.reflect.Method.invoke(Method.java:497)[:1.8.045] at org.ops4j.pax.exam.rbc.internal.RemoteBundleContextImpl.remoteCall(RemoteBundleContextImpl.java:80) at sun.reflect.NativeMethodAccessorImpl.invoke0(Native Method)[:1.8.045] at sun.reflect.NativeMethodAccessorImpl.invoke(NativeMethodAccessorImpl.java:62)[:1.8.045] at sun.reflect.DelegatingMethodAccessorImpl.invoke(DelegatingMethodAccessorImpl.java:43)[:1.8.045] at java.lang.reflect.Method.invoke(Method.java:497)[:1.8.045] at sun.rmi.server.UnicastServerRef.dispatch(UnicastServerRef.java:323)[:1.8.045] at sun.rmi.transport.Transport$1.run(Transport.java:200)[:1.8.045] at sun.rmi.transport.Transport$1.run(Transport.java:197)[:1.8.045] at java.security.AccessController.doPrivileged(Native Method)[:1.8.045] at sun.rmi.transport.Transport.serviceCall(Transport.java:196)[:1.8.045] at sun.rmi.transport.tcp.TCPTransport.handleMessages(TCPTransport.java:568)[:1.8.045] at sun.rmi.transport.tcp.TCPTransport$ConnectionHandler.run0(TCPTransport.java:826)[:1.8.045] at sun.rmi.transport.tcp.TCPTransport$ConnectionHandler.lambda$run$241(TCPTransport.java:683)[:1.8.045] at sun.rmi.transport.tcp.TCPTransport$ConnectionHandler$$Lambda$1/590623838.run(Unknown Source) at java.security.AccessController.doPrivileged(Native Method)[:1.8.045] at sun.rmi.transport.tcp.TCPTransport$ConnectionHandler.run(TCPTransport.java:682)[:1.8.045] at java.util.concurrent.ThreadPoolExecutor.runWorker(ThreadPoolExecutor.java:1142)[:1.8.045] at java.util.concurrent.ThreadPoolExecutor$Worker.run(ThreadPoolExecutor.java:617)[:1.8.045] at java.lang.Thread.run(Thread.java:745)[:1.8.045] Caused by: shaded.org.eclipse.aether.transfer.ArtifactNotFoundException: Could not find artifact org.opendaylight.aaa:features-aaa-shiro:xml:features:0.3.0-SNAPSHOT at shaded.org.eclipse.aether.internal.impl.DefaultArtifactResolver.resolve(DefaultArtifactResolver.java:434) ... 64 more 2016-01-02 09:05:53,268 | WARN | FelixShutdown | core | 75 - org.apache.aries.jmx.core - 1.1.2 | Task rejected for JMX Notification dispatch of event [org.osgi.framework.ServiceEvent[source=[javax.management.MBeanServer]]] - Dispatcher may have been shutdown Jan 02, 2016 9:05:53 AM org.ops4j.pax.exam.spi.reactors.ReactorManager afterClass INFO: suite finished Jan 02, 2016 9:05:53 AM org.opendaylight.odlparent.featuretest.PerRepoTestRunner runChild INFO: About to run test for file:/home/odldev/git/hello/features/target/classes/features.xml Jan 02, 2016 9:05:53 AM org.opendaylight.odlparent.featuretest.PerFeatureRunner run INFO: About to run test for feature: odl-hello-rest 1.0.0-SNAPSHOT Jan 02, 2016 9:05:53 AM org.ops4j.pax.exam.junit.impl.ProbeRunner run INFO: running test class org.opendaylight.odlparent.featuretest.SingleFeatureTest Jan 02, 2016 9:05:54 AM org.ops4j.pax.exam.karaf.container.internal.KarafTestContainer startKaraf INFO: Wait for test container to finish its initialization [ RelativeTimeout value = 180000 ] Jan 02, 2016 9:05:54 AM org.ops4j.pax.exam.rbc.client.intern.RemoteBundleContextClientImpl getRemoteBundleContext INFO: Waiting for remote bundle context.. on 21000 name: 36d7d572-0e2c-49df-94ed-5fa712ce360c timout: [ RelativeTimeout value = 180000 ] 2016-01-02 09:06:06,844 | INFO | ion(3)-127.0.0.1 | SingleFeatureTest | 84 - PAXEXAM-PROBE-e2caa69c-7d9d-45ff-b017-0747cfa76574 - 0.0.0 | Attempting to add repository file:/home/odldev/git/hello/features/target/classes/features.xml 2016-01-02 09:06:06,864 | INFO | ion(3)-127.0.0.1 | SingleFeatureTest | 84 - PAXEXAM-PROBE-e2caa69c-7d9d-45ff-b017-0747cfa76574 - 0.0.0 | Successfully loaded repository file:/home/odldev/git/hello/features/target/classes/features.xml 2016-01-02 09:06:06,864 | INFO | ion(3)-127.0.0.1 | SingleFeatureTest | 84 - PAXEXAM-PROBE-e2caa69c-7d9d-45ff-b017-0747cfa76574 - 0.0.0 | Attempting to install feature odl-hello-rest 1.0.0-SNAPSHOT 2016-01-02 09:06:07,145 | WARN | ion(3)-127.0.0.1 | AetherBasedResolver | 1 - org.ops4j.pax.url.mvn - 2.2.0 | Error resolving artifactorg.opendaylight.aaa:features-aaa-shiro:xml:features:0.3.0-SNAPSHOT:Could not find artifact org.opendaylight.aaa:features-aaa-shiro:xml:features:0.3.0-SNAPSHOT shaded.org.eclipse.aether.resolution.ArtifactResolutionException: Could not find artifact org.opendaylight.aaa:features-aaa-shiro:xml:features:0.3.0-SNAPSHOT at shaded.org.eclipse.aether.internal.impl.DefaultArtifactResolver.resolve(DefaultArtifactResolver.java:444) at shaded.org.eclipse.aether.internal.impl.DefaultArtifactResolver.resolveArtifacts(DefaultArtifactResolver.java:246) at shaded.org.eclipse.aether.internal.impl.DefaultArtifactResolver.resolveArtifact(DefaultArtifactResolver.java:223) at shaded.org.eclipse.aether.internal.impl.DefaultRepositorySystem.resolveArtifact(DefaultRepositorySystem.java:294) at org.ops4j.pax.url.mvn.internal.AetherBasedResolver.resolve(AetherBasedResolver.java:344) at org.ops4j.pax.url.mvn.internal.AetherBasedResolver.resolveFile(AetherBasedResolver.java:313) at org.ops4j.pax.url.mvn.internal.AetherBasedResolver.resolve(AetherBasedResolver.java:297) at org.ops4j.pax.url.mvn.internal.Connection.getInputStream(Connection.java:131) at org.apache.karaf.features.internal.FeatureValidationUtil.load(FeatureValidationUtil.java:93) at org.apache.karaf.features.internal.FeatureValidationUtil.validate(FeatureValidationUtil.java:58) at org.apache.karaf.features.internal.FeaturesServiceImpl.validateRepository(FeaturesServiceImpl.java:162) at org.apache.karaf.features.internal.FeaturesServiceImpl.internalAddRepository(FeaturesServiceImpl.java:233) at org.apache.karaf.features.internal.FeaturesServiceImpl.getFeatures(FeaturesServiceImpl.java:813) at org.apache.karaf.features.internal.FeaturesServiceImpl.getFeature(FeaturesServiceImpl.java:771) at org.apache.karaf.features.internal.FeaturesServiceImpl.installFeature(FeaturesServiceImpl.java:359) at org.apache.karaf.features.internal.FeaturesServiceImpl.installFeature(FeaturesServiceImpl.java:347) at Proxy345b036fe9724c928ad4f5c75e386f16.installFeature(Unknown Source) at org.opendaylight.odlparent.featuretest.SingleFeatureTest.installFeature(SingleFeatureTest.java:207) at sun.reflect.NativeMethodAccessorImpl.invoke0(Native Method)[:1.8.045] at sun.reflect.NativeMethodAccessorImpl.invoke(NativeMethodAccessorImpl.java:62)[:1.8.045] at sun.reflect.DelegatingMethodAccessorImpl.invoke(DelegatingMethodAccessorImpl.java:43)[:1.8.045] at java.lang.reflect.Method.invoke(Method.java:497)[:1.8.045] at org.junit.runners.model.FrameworkMethod$1.runReflectiveCall(FrameworkMethod.java:50) at org.junit.internal.runners.model.ReflectiveCallable.run(ReflectiveCallable.java:12) at org.junit.runners.model.FrameworkMethod.invokeExplosively(FrameworkMethod.java:47) at org.junit.internal.runners.statements.InvokeMethod.evaluate(InvokeMethod.java:17) at org.junit.internal.runners.statements.RunBefores.evaluate(RunBefores.java:26) at org.junit.runners.ParentRunner.runLeaf(ParentRunner.java:325) at org.junit.runners.BlockJUnit4ClassRunner.runChild(BlockJUnit4ClassRunner.java:78) at org.ops4j.pax.exam.invoker.junit.internal.ContainerTestRunner.runChild(ContainerTestRunner.java:68) at org.ops4j.pax.exam.invoker.junit.internal.ContainerTestRunner.runChild(ContainerTestRunner.java:37) at org.junit.runners.ParentRunner$3.run(ParentRunner.java:290) at org.junit.runners.ParentRunner$1.schedule(ParentRunner.java:71) at org.junit.runners.ParentRunner.runChildren(ParentRunner.java:288) at org.junit.runners.ParentRunner.access$000(ParentRunner.java:58) at org.junit.runners.ParentRunner$2.evaluate(ParentRunner.java:268) at org.junit.runners.ParentRunner.run(ParentRunner.java:363) at org.junit.runner.JUnitCore.run(JUnitCore.java:137) at org.junit.runner.JUnitCore.run(JUnitCore.java:115) at org.ops4j.pax.exam.invoker.junit.internal.JUnitProbeInvoker.invokeViaJUnit(JUnitProbeInvoker.java:124) at org.ops4j.pax.exam.invoker.junit.internal.JUnitProbeInvoker.findAndInvoke(JUnitProbeInvoker.java:97) at org.ops4j.pax.exam.invoker.junit.internal.JUnitProbeInvoker.call(JUnitProbeInvoker.java:73) at sun.reflect.NativeMethodAccessorImpl.invoke0(Native Method)[:1.8.045] at sun.reflect.NativeMethodAccessorImpl.invoke(NativeMethodAccessorImpl.java:62)[:1.8.045] at sun.reflect.DelegatingMethodAccessorImpl.invoke(DelegatingMethodAccessorImpl.java:43)[:1.8.045] at java.lang.reflect.Method.invoke(Method.java:497)[:1.8.045] at org.ops4j.pax.exam.rbc.internal.RemoteBundleContextImpl.remoteCall(RemoteBundleContextImpl.java:80) at sun.reflect.NativeMethodAccessorImpl.invoke0(Native Method)[:1.8.045] at sun.reflect.NativeMethodAccessorImpl.invoke(NativeMethodAccessorImpl.java:62)[:1.8.045] at sun.reflect.DelegatingMethodAccessorImpl.invoke(DelegatingMethodAccessorImpl.java:43)[:1.8.045] at java.lang.reflect.Method.invoke(Method.java:497)[:1.8.045] at sun.rmi.server.UnicastServerRef.dispatch(UnicastServerRef.java:323)[:1.8.045] at sun.rmi.transport.Transport$1.run(Transport.java:200)[:1.8.045] at sun.rmi.transport.Transport$1.run(Transport.java:197)[:1.8.045] at java.security.AccessController.doPrivileged(Native Method)[:1.8.045] at sun.rmi.transport.Transport.serviceCall(Transport.java:196)[:1.8.045] at sun.rmi.transport.tcp.TCPTransport.handleMessages(TCPTransport.java:568)[:1.8.045] at sun.rmi.transport.tcp.TCPTransport$ConnectionHandler.run0(TCPTransport.java:826)[:1.8.045] at sun.rmi.transport.tcp.TCPTransport$ConnectionHandler.lambda$run$241(TCPTransport.java:683)[:1.8.045] at sun.rmi.transport.tcp.TCPTransport$ConnectionHandler$$Lambda$1/800505818.run(Unknown Source) at java.security.AccessController.doPrivileged(Native Method)[:1.8.045] at sun.rmi.transport.tcp.TCPTransport$ConnectionHandler.run(TCPTransport.java:682)[:1.8.045] at java.util.concurrent.ThreadPoolExecutor.runWorker(ThreadPoolExecutor.java:1142)[:1.8.045] at java.util.concurrent.ThreadPoolExecutor$Worker.run(ThreadPoolExecutor.java:617)[:1.8.045] at java.lang.Thread.run(Thread.java:745)[:1.8.045] Caused by: shaded.org.eclipse.aether.transfer.ArtifactNotFoundException: Could not find artifact org.opendaylight.aaa:features-aaa-shiro:xml:features:0.3.0-SNAPSHOT at shaded.org.eclipse.aether.internal.impl.DefaultArtifactResolver.resolve(DefaultArtifactResolver.java:434) ... 64 more 2016-01-02 09:06:07,532 | WARN | FelixShutdown | core | 75 - org.apache.aries.jmx.core - 1.1.2 | Task rejected for JMX Notification dispatch of event [org.osgi.framework.ServiceEvent[source=[javax.management.MBeanServer]]] - Dispatcher may have been shutdown Jan 02, 2016 9:06:08 AM org.ops4j.pax.exam.spi.reactors.ReactorManager afterClass INFO: suite finished Jan 02, 2016 9:06:08 AM org.opendaylight.odlparent.featuretest.PerRepoTestRunner runChild INFO: About to run test for file:/home/odldev/git/hello/features/target/classes/features.xml Jan 02, 2016 9:06:08 AM org.opendaylight.odlparent.featuretest.PerFeatureRunner run INFO: About to run test for feature: odl-hello-ui 1.0.0-SNAPSHOT Jan 02, 2016 9:06:08 AM org.ops4j.pax.exam.junit.impl.ProbeRunner run INFO: running test class org.opendaylight.odlparent.featuretest.SingleFeatureTest Jan 02, 2016 9:06:08 AM org.ops4j.pax.exam.karaf.container.internal.KarafTestContainer startKaraf INFO: Wait for test container to finish its initialization [ RelativeTimeout value = 180000 ] Jan 02, 2016 9:06:08 AM org.ops4j.pax.exam.rbc.client.intern.RemoteBundleContextClientImpl getRemoteBundleContext INFO: Waiting for remote bundle context.. on 21000 name: 9beb90a5-10de-47ce-8ffc-13d7683b1f09 timout: [ RelativeTimeout value = 180000 ] 2016-01-02 09:06:24,127 | INFO | ion(3)-127.0.0.1 | SingleFeatureTest | 84 - PAXEXAM-PROBE-e2caa69c-7d9d-45ff-b017-0747cfa76574 - 0.0.0 | Attempting to add repository file:/home/odldev/git/hello/features/target/classes/features.xml 2016-01-02 09:06:24,278 | INFO | ion(3)-127.0.0.1 | SingleFeatureTest | 84 - PAXEXAM-PROBE-e2caa69c-7d9d-45ff-b017-0747cfa76574 - 0.0.0 | Successfully loaded repository file:/home/odldev/git/hello/features/target/classes/features.xml 2016-01-02 09:06:24,280 | INFO | ion(3)-127.0.0.1 | SingleFeatureTest | 84 - PAXEXAM-PROBE-e2caa69c-7d9d-45ff-b017-0747cfa76574 - 0.0.0 | Attempting to install feature odl-hello-ui 1.0.0-SNAPSHOT 2016-01-02 09:06:24,824 | WARN | ion(3)-127.0.0.1 | AetherBasedResolver | 1 - org.ops4j.pax.url.mvn - 2.2.0 | Error resolving artifactorg.opendaylight.aaa:features-aaa-shiro:xml:features:0.3.0-SNAPSHOT:Could not find artifact org.opendaylight.aaa:features-aaa-shiro:xml:features:0.3.0-SNAPSHOT shaded.org.eclipse.aether.resolution.ArtifactResolutionException: Could not find artifact org.opendaylight.aaa:features-aaa-shiro:xml:features:0.3.0-SNAPSHOT at shaded.org.eclipse.aether.internal.impl.DefaultArtifactResolver.resolve(DefaultArtifactResolver.java:444) at shaded.org.eclipse.aether.internal.impl.DefaultArtifactResolver.resolveArtifacts(DefaultArtifactResolver.java:246) at shaded.org.eclipse.aether.internal.impl.DefaultArtifactResolver.resolveArtifact(DefaultArtifactResolver.java:223) at shaded.org.eclipse.aether.internal.impl.DefaultRepositorySystem.resolveArtifact(DefaultRepositorySystem.java:294) at org.ops4j.pax.url.mvn.internal.AetherBasedResolver.resolve(AetherBasedResolver.java:344) at org.ops4j.pax.url.mvn.internal.AetherBasedResolver.resolveFile(AetherBasedResolver.java:313) at org.ops4j.pax.url.mvn.internal.AetherBasedResolver.resolve(AetherBasedResolver.java:297) at org.ops4j.pax.url.mvn.internal.Connection.getInputStream(Connection.java:131) at org.apache.karaf.features.internal.FeatureValidationUtil.load(FeatureValidationUtil.java:93) at org.apache.karaf.features.internal.FeatureValidationUtil.validate(FeatureValidationUtil.java:58) at org.apache.karaf.features.internal.FeaturesServiceImpl.validateRepository(FeaturesServiceImpl.java:162) at org.apache.karaf.features.internal.FeaturesServiceImpl.internalAddRepository(FeaturesServiceImpl.java:233) at org.apache.karaf.features.internal.FeaturesServiceImpl.getFeatures(FeaturesServiceImpl.java:813) at org.apache.karaf.features.internal.FeaturesServiceImpl.getFeature(FeaturesServiceImpl.java:771) at org.apache.karaf.features.internal.FeaturesServiceImpl.installFeature(FeaturesServiceImpl.java:359) at org.apache.karaf.features.internal.FeaturesServiceImpl.installFeature(FeaturesServiceImpl.java:347) at Proxyc3a10f39e0c1426fa80b4c32b1e260f0.installFeature(Unknown Source) at org.opendaylight.odlparent.featuretest.SingleFeatureTest.installFeature(SingleFeatureTest.java:207) at sun.reflect.NativeMethodAccessorImpl.invoke0(Native Method)[:1.8.045] at sun.reflect.NativeMethodAccessorImpl.invoke(NativeMethodAccessorImpl.java:62)[:1.8.045] at sun.reflect.DelegatingMethodAccessorImpl.invoke(DelegatingMethodAccessorImpl.java:43)[:1.8.045] at java.lang.reflect.Method.invoke(Method.java:497)[:1.8.045] at org.junit.runners.model.FrameworkMethod$1.runReflectiveCall(FrameworkMethod.java:50) at org.junit.internal.runners.model.ReflectiveCallable.run(ReflectiveCallable.java:12) at org.junit.runners.model.FrameworkMethod.invokeExplosively(FrameworkMethod.java:47) at org.junit.internal.runners.statements.InvokeMethod.evaluate(InvokeMethod.java:17) at org.junit.internal.runners.statements.RunBefores.evaluate(RunBefores.java:26) at org.junit.runners.ParentRunner.runLeaf(ParentRunner.java:325) at org.junit.runners.BlockJUnit4ClassRunner.runChild(BlockJUnit4ClassRunner.java:78) at org.ops4j.pax.exam.invoker.junit.internal.ContainerTestRunner.runChild(ContainerTestRunner.java:68) at org.ops4j.pax.exam.invoker.junit.internal.ContainerTestRunner.runChild(ContainerTestRunner.java:37) at org.junit.runners.ParentRunner$3.run(ParentRunner.java:290) at org.junit.runners.ParentRunner$1.schedule(ParentRunner.java:71) at org.junit.runners.ParentRunner.runChildren(ParentRunner.java:288) at org.junit.runners.ParentRunner.access$000(ParentRunner.java:58) at org.junit.runners.ParentRunner$2.evaluate(ParentRunner.java:268) at org.junit.runners.ParentRunner.run(ParentRunner.java:363) at org.junit.runner.JUnitCore.run(JUnitCore.java:137) at org.junit.runner.JUnitCore.run(JUnitCore.java:115) at org.ops4j.pax.exam.invoker.junit.internal.JUnitProbeInvoker.invokeViaJUnit(JUnitProbeInvoker.java:124) at org.ops4j.pax.exam.invoker.junit.internal.JUnitProbeInvoker.findAndInvoke(JUnitProbeInvoker.java:97) at org.ops4j.pax.exam.invoker.junit.internal.JUnitProbeInvoker.call(JUnitProbeInvoker.java:73) at sun.reflect.NativeMethodAccessorImpl.invoke0(Native Method)[:1.8.045] at sun.reflect.NativeMethodAccessorImpl.invoke(NativeMethodAccessorImpl.java:62)[:1.8.045] at sun.reflect.DelegatingMethodAccessorImpl.invoke(DelegatingMethodAccessorImpl.java:43)[:1.8.045] at java.lang.reflect.Method.invoke(Method.java:497)[:1.8.045] at org.ops4j.pax.exam.rbc.internal.RemoteBundleContextImpl.remoteCall(RemoteBundleContextImpl.java:80) at sun.reflect.NativeMethodAccessorImpl.invoke0(Native Method)[:1.8.045] at sun.reflect.NativeMethodAccessorImpl.invoke(NativeMethodAccessorImpl.java:62)[:1.8.045] at sun.reflect.DelegatingMethodAccessorImpl.invoke(DelegatingMethodAccessorImpl.java:43)[:1.8.045] at java.lang.reflect.Method.invoke(Method.java:497)[:1.8.045] at sun.rmi.server.UnicastServerRef.dispatch(UnicastServerRef.java:323)[:1.8.045] at sun.rmi.transport.Transport$1.run(Transport.java:200)[:1.8.045] at sun.rmi.transport.Transport$1.run(Transport.java:197)[:1.8.045] at java.security.AccessController.doPrivileged(Native Method)[:1.8.045] at sun.rmi.transport.Transport.serviceCall(Transport.java:196)[:1.8.045] at sun.rmi.transport.tcp.TCPTransport.handleMessages(TCPTransport.java:568)[:1.8.045] at sun.rmi.transport.tcp.TCPTransport$ConnectionHandler.run0(TCPTransport.java:826)[:1.8.045] at sun.rmi.transport.tcp.TCPTransport$ConnectionHandler.lambda$run$241(TCPTransport.java:683)[:1.8.045] at sun.rmi.transport.tcp.TCPTransport$ConnectionHandler$$Lambda$1/722776432.run(Unknown Source) at java.security.AccessController.doPrivileged(Native Method)[:1.8.045] at sun.rmi.transport.tcp.TCPTransport$ConnectionHandler.run(TCPTransport.java:682)[:1.8.045] at java.util.concurrent.ThreadPoolExecutor.runWorker(ThreadPoolExecutor.java:1142)[:1.8.045] at java.util.concurrent.ThreadPoolExecutor$Worker.run(ThreadPoolExecutor.java:617)[:1.8.045] at java.lang.Thread.run(Thread.java:745)[:1.8.045] Caused by: shaded.org.eclipse.aether.transfer.ArtifactNotFoundException: Could not find artifact org.opendaylight.aaa:features-aaa-shiro:xml:features:0.3.0-SNAPSHOT at shaded.org.eclipse.aether.internal.impl.DefaultArtifactResolver.resolve(DefaultArtifactResolver.java:434) ... 64 more 2016-01-02 09:06:26,256 | WARN | FelixShutdown | core | 75 - org.apache.aries.jmx.core - 1.1.2 | Task rejected for JMX Notification dispatch of event [org.osgi.framework.ServiceEvent[source=[javax.management.MBeanServer]]] - Dispatcher may have been shutdown Jan 02, 2016 9:06:26 AM org.ops4j.pax.exam.spi.reactors.ReactorManager afterClass INFO: suite finished Tests run: 4, Failures: 0, Errors: 4, Skipped: 0, Time elapsed: 64.817 sec <<< FAILURE! - in org.opendaylight.odlparent.featuretest.SingleFeatureTest installFeature(org.opendaylight.odlparent.featuretest.SingleFeatureTest)[repoUrl: file:/home/odldev/git/hello/features/target/classes/features.xml, Feature: odl-hello-api 1.0.0-SNAPSHOT] Time elapsed: 20.059 sec <<< ERROR! java.io.IOException: Error resolving artifact org.opendaylight.aaa:features-aaa-shiro:xml:features:0.3.0-SNAPSHOT: Could not find artifact org.opendaylight.aaa:features-aaa-shiro:xml:features:0.3.0-SNAPSHOT at org.ops4j.pax.url.mvn.internal.AetherBasedResolver.resolve(AetherBasedResolver.java:355) at org.ops4j.pax.url.mvn.internal.AetherBasedResolver.resolveFile(AetherBasedResolver.java:313) at org.ops4j.pax.url.mvn.internal.AetherBasedResolver.resolve(AetherBasedResolver.java:297) at org.ops4j.pax.url.mvn.internal.Connection.getInputStream(Connection.java:131) at org.apache.karaf.features.internal.FeatureValidationUtil.load(FeatureValidationUtil.java:93) at org.apache.karaf.features.internal.FeatureValidationUtil.validate(FeatureValidationUtil.java:58) at org.apache.karaf.features.internal.FeaturesServiceImpl.validateRepository(FeaturesServiceImpl.java:162) at org.apache.karaf.features.internal.FeaturesServiceImpl.internalAddRepository(FeaturesServiceImpl.java:233) at org.apache.karaf.features.internal.FeaturesServiceImpl.getFeatures(FeaturesServiceImpl.java:813) at org.apache.karaf.features.internal.FeaturesServiceImpl.getFeature(FeaturesServiceImpl.java:771) at org.apache.karaf.features.internal.FeaturesServiceImpl.installFeature(FeaturesServiceImpl.java:359) at org.apache.karaf.features.internal.FeaturesServiceImpl.installFeature(FeaturesServiceImpl.java:347) at Proxy7e73e05b6bf2437e9eff189d0f002f62.installFeature(Unknown Source) at org.opendaylight.odlparent.featuretest.SingleFeatureTest.installFeature(SingleFeatureTest.java:207) at sun.reflect.NativeMethodAccessorImpl.invoke0(Native Method) at sun.reflect.NativeMethodAccessorImpl.invoke(NativeMethodAccessorImpl.java:62) at sun.reflect.DelegatingMethodAccessorImpl.invoke(DelegatingMethodAccessorImpl.java:43) at java.lang.reflect.Method.invoke(Method.java:497) at org.junit.runners.model.FrameworkMethod$1.runReflectiveCall(FrameworkMethod.java:50) at org.junit.internal.runners.model.ReflectiveCallable.run(ReflectiveCallable.java:12) at org.junit.runners.model.FrameworkMethod.invokeExplosively(FrameworkMethod.java:47) at org.junit.internal.runners.statements.InvokeMethod.evaluate(InvokeMethod.java:17) at org.junit.internal.runners.statements.RunBefores.evaluate(RunBefores.java:26) at org.junit.runners.ParentRunner.runLeaf(ParentRunner.java:325) at org.junit.runners.BlockJUnit4ClassRunner.runChild(BlockJUnit4ClassRunner.java:78) at org.ops4j.pax.exam.invoker.junit.internal.ContainerTestRunner.runChild(ContainerTestRunner.java:68) at org.ops4j.pax.exam.invoker.junit.internal.ContainerTestRunner.runChild(ContainerTestRunner.java:37) at org.junit.runners.ParentRunner$3.run(ParentRunner.java:290) at org.junit.runners.ParentRunner$1.schedule(ParentRunner.java:71) at org.junit.runners.ParentRunner.runChildren(ParentRunner.java:288) at org.junit.runners.ParentRunner.access$000(ParentRunner.java:58) at org.junit.runners.ParentRunner$2.evaluate(ParentRunner.java:268) at org.junit.runners.ParentRunner.run(ParentRunner.java:363) at org.junit.runner.JUnitCore.run(JUnitCore.java:137) at org.junit.runner.JUnitCore.run(JUnitCore.java:115) at org.ops4j.pax.exam.invoker.junit.internal.JUnitProbeInvoker.invokeViaJUnit(JUnitProbeInvoker.java:124) at org.ops4j.pax.exam.invoker.junit.internal.JUnitProbeInvoker.findAndInvoke(JUnitProbeInvoker.java:97) at org.ops4j.pax.exam.invoker.junit.internal.JUnitProbeInvoker.call(JUnitProbeInvoker.java:73) at sun.reflect.NativeMethodAccessorImpl.invoke0(Native Method) at sun.reflect.NativeMethodAccessorImpl.invoke(NativeMethodAccessorImpl.java:62) at sun.reflect.DelegatingMethodAccessorImpl.invoke(DelegatingMethodAccessorImpl.java:43) at java.lang.reflect.Method.invoke(Method.java:497) at org.ops4j.pax.exam.rbc.internal.RemoteBundleContextImpl.remoteCall(RemoteBundleContextImpl.java:80) at sun.reflect.NativeMethodAccessorImpl.invoke0(Native Method) at sun.reflect.NativeMethodAccessorImpl.invoke(NativeMethodAccessorImpl.java:62) at sun.reflect.DelegatingMethodAccessorImpl.invoke(DelegatingMethodAccessorImpl.java:43) at java.lang.reflect.Method.invoke(Method.java:497) at sun.rmi.server.UnicastServerRef.dispatch(UnicastServerRef.java:323) at sun.rmi.transport.Transport$1.run(Transport.java:200) at sun.rmi.transport.Transport$1.run(Transport.java:197) at java.security.AccessController.doPrivileged(Native Method) at sun.rmi.transport.Transport.serviceCall(Transport.java:196) at sun.rmi.transport.tcp.TCPTransport.handleMessages(TCPTransport.java:568) at sun.rmi.transport.tcp.TCPTransport$ConnectionHandler.run0(TCPTransport.java:826) at sun.rmi.transport.tcp.TCPTransport$ConnectionHandler.lambda$run$241(TCPTransport.java:683) at sun.rmi.transport.tcp.TCPTransport$ConnectionHandler$$Lambda$1/1292811496.run(Unknown Source) at java.security.AccessController.doPrivileged(Native Method) at sun.rmi.transport.tcp.TCPTransport$ConnectionHandler.run(TCPTransport.java:682) at java.util.concurrent.ThreadPoolExecutor.runWorker(ThreadPoolExecutor.java:1142) at java.util.concurrent.ThreadPoolExecutor$Worker.run(ThreadPoolExecutor.java:617) at java.lang.Thread.run(Thread.java:745)

installFeature(org.opendaylight.odlparent.featuretest.SingleFeatureTest)[repoUrl: file:/home/odldev/git/hello/features/target/classes/features.xml, Feature: odl-hello 1.0.0-SNAPSHOT] Time elapsed: 11.411 sec <<< ERROR! java.io.IOException: Error resolving artifact org.opendaylight.aaa:features-aaa-shiro:xml:features:0.3.0-SNAPSHOT: Could not find artifact org.opendaylight.aaa:features-aaa-shiro:xml:features:0.3.0-SNAPSHOT at org.ops4j.pax.url.mvn.internal.AetherBasedResolver.resolve(AetherBasedResolver.java:355) at org.ops4j.pax.url.mvn.internal.AetherBasedResolver.resolveFile(AetherBasedResolver.java:313) at org.ops4j.pax.url.mvn.internal.AetherBasedResolver.resolve(AetherBasedResolver.java:297) at org.ops4j.pax.url.mvn.internal.Connection.getInputStream(Connection.java:131) at org.apache.karaf.features.internal.FeatureValidationUtil.load(FeatureValidationUtil.java:93) at org.apache.karaf.features.internal.FeatureValidationUtil.validate(FeatureValidationUtil.java:58) at org.apache.karaf.features.internal.FeaturesServiceImpl.validateRepository(FeaturesServiceImpl.java:162) at org.apache.karaf.features.internal.FeaturesServiceImpl.internalAddRepository(FeaturesServiceImpl.java:233) at org.apache.karaf.features.internal.FeaturesServiceImpl.getFeatures(FeaturesServiceImpl.java:813) at org.apache.karaf.features.internal.FeaturesServiceImpl.getFeature(FeaturesServiceImpl.java:771) at org.apache.karaf.features.internal.FeaturesServiceImpl.installFeature(FeaturesServiceImpl.java:359) at org.apache.karaf.features.internal.FeaturesServiceImpl.installFeature(FeaturesServiceImpl.java:347) at Proxy8e3ebab468b24ee9aa60a6c7c22d1e8a.installFeature(Unknown Source) at org.opendaylight.odlparent.featuretest.SingleFeatureTest.installFeature(SingleFeatureTest.java:207) at sun.reflect.NativeMethodAccessorImpl.invoke0(Native Method) at sun.reflect.NativeMethodAccessorImpl.invoke(NativeMethodAccessorImpl.java:62) at sun.reflect.DelegatingMethodAccessorImpl.invoke(DelegatingMethodAccessorImpl.java:43) at java.lang.reflect.Method.invoke(Method.java:497) at org.junit.runners.model.FrameworkMethod$1.runReflectiveCall(FrameworkMethod.java:50) at org.junit.internal.runners.model.ReflectiveCallable.run(ReflectiveCallable.java:12) at org.junit.runners.model.FrameworkMethod.invokeExplosively(FrameworkMethod.java:47) at org.junit.internal.runners.statements.InvokeMethod.evaluate(InvokeMethod.java:17) at org.junit.internal.runners.statements.RunBefores.evaluate(RunBefores.java:26) at org.junit.runners.ParentRunner.runLeaf(ParentRunner.java:325) at org.junit.runners.BlockJUnit4ClassRunner.runChild(BlockJUnit4ClassRunner.java:78) at org.ops4j.pax.exam.invoker.junit.internal.ContainerTestRunner.runChild(ContainerTestRunner.java:68) at org.ops4j.pax.exam.invoker.junit.internal.ContainerTestRunner.runChild(ContainerTestRunner.java:37) at org.junit.runners.ParentRunner$3.run(ParentRunner.java:290) at org.junit.runners.ParentRunner$1.schedule(ParentRunner.java:71) at org.junit.runners.ParentRunner.runChildren(ParentRunner.java:288) at org.junit.runners.ParentRunner.access$000(ParentRunner.java:58) at org.junit.runners.ParentRunner$2.evaluate(ParentRunner.java:268) at org.junit.runners.ParentRunner.run(ParentRunner.java:363) at org.junit.runner.JUnitCore.run(JUnitCore.java:137) at org.junit.runner.JUnitCore.run(JUnitCore.java:115) at org.ops4j.pax.exam.invoker.junit.internal.JUnitProbeInvoker.invokeViaJUnit(JUnitProbeInvoker.java:124) at org.ops4j.pax.exam.invoker.junit.internal.JUnitProbeInvoker.findAndInvoke(JUnitProbeInvoker.java:97) at org.ops4j.pax.exam.invoker.junit.internal.JUnitProbeInvoker.call(JUnitProbeInvoker.java:73) at sun.reflect.NativeMethodAccessorImpl.invoke0(Native Method) at sun.reflect.NativeMethodAccessorImpl.invoke(NativeMethodAccessorImpl.java:62) at sun.reflect.DelegatingMethodAccessorImpl.invoke(DelegatingMethodAccessorImpl.java:43) at java.lang.reflect.Method.invoke(Method.java:497) at org.ops4j.pax.exam.rbc.internal.RemoteBundleContextImpl.remoteCall(RemoteBundleContextImpl.java:80) at sun.reflect.NativeMethodAccessorImpl.invoke0(Native Method) at sun.reflect.NativeMethodAccessorImpl.invoke(NativeMethodAccessorImpl.java:62) at sun.reflect.DelegatingMethodAccessorImpl.invoke(DelegatingMethodAccessorImpl.java:43) at java.lang.reflect.Method.invoke(Method.java:497) at sun.rmi.server.UnicastServerRef.dispatch(UnicastServerRef.java:323) at sun.rmi.transport.Transport$1.run(Transport.java:200) at sun.rmi.transport.Transport$1.run(Transport.java:197) at java.security.AccessController.doPrivileged(Native Method) at sun.rmi.transport.Transport.serviceCall(Transport.java:196) at sun.rmi.transport.tcp.TCPTransport.handleMessages(TCPTransport.java:568) at sun.rmi.transport.tcp.TCPTransport$ConnectionHandler.run0(TCPTransport.java:826) at sun.rmi.transport.tcp.TCPTransport$ConnectionHandler.lambda$run$241(TCPTransport.java:683) at sun.rmi.transport.tcp.TCPTransport$ConnectionHandler$$Lambda$1/590623838.run(Unknown Source) at java.security.AccessController.doPrivileged(Native Method) at sun.rmi.transport.tcp.TCPTransport$ConnectionHandler.run(TCPTransport.java:682) at java.util.concurrent.ThreadPoolExecutor.runWorker(ThreadPoolExecutor.java:1142) at java.util.concurrent.ThreadPoolExecutor$Worker.run(ThreadPoolExecutor.java:617) at java.lang.Thread.run(Thread.java:745)

installFeature(org.opendaylight.odlparent.featuretest.SingleFeatureTest)[repoUrl: file:/home/odldev/git/hello/features/target/classes/features.xml, Feature: odl-hello-rest 1.0.0-SNAPSHOT] Time elapsed: 14.23 sec <<< ERROR! java.io.IOException: Error resolving artifact org.opendaylight.aaa:features-aaa-shiro:xml:features:0.3.0-SNAPSHOT: Could not find artifact org.opendaylight.aaa:features-aaa-shiro:xml:features:0.3.0-SNAPSHOT at org.ops4j.pax.url.mvn.internal.AetherBasedResolver.resolve(AetherBasedResolver.java:355) at org.ops4j.pax.url.mvn.internal.AetherBasedResolver.resolveFile(AetherBasedResolver.java:313) at org.ops4j.pax.url.mvn.internal.AetherBasedResolver.resolve(AetherBasedResolver.java:297) at org.ops4j.pax.url.mvn.internal.Connection.getInputStream(Connection.java:131) at org.apache.karaf.features.internal.FeatureValidationUtil.load(FeatureValidationUtil.java:93) at org.apache.karaf.features.internal.FeatureValidationUtil.validate(FeatureValidationUtil.java:58) at org.apache.karaf.features.internal.FeaturesServiceImpl.validateRepository(FeaturesServiceImpl.java:162) at org.apache.karaf.features.internal.FeaturesServiceImpl.internalAddRepository(FeaturesServiceImpl.java:233) at org.apache.karaf.features.internal.FeaturesServiceImpl.getFeatures(FeaturesServiceImpl.java:813) at org.apache.karaf.features.internal.FeaturesServiceImpl.getFeature(FeaturesServiceImpl.java:771) at org.apache.karaf.features.internal.FeaturesServiceImpl.installFeature(FeaturesServiceImpl.java:359) at org.apache.karaf.features.internal.FeaturesServiceImpl.installFeature(FeaturesServiceImpl.java:347) at Proxy345b036fe9724c928ad4f5c75e386f16.installFeature(Unknown Source) at org.opendaylight.odlparent.featuretest.SingleFeatureTest.installFeature(SingleFeatureTest.java:207) at sun.reflect.NativeMethodAccessorImpl.invoke0(Native Method) at sun.reflect.NativeMethodAccessorImpl.invoke(NativeMethodAccessorImpl.java:62) at sun.reflect.DelegatingMethodAccessorImpl.invoke(DelegatingMethodAccessorImpl.java:43) at java.lang.reflect.Method.invoke(Method.java:497) at org.junit.runners.model.FrameworkMethod$1.runReflectiveCall(FrameworkMethod.java:50) at org.junit.internal.runners.model.ReflectiveCallable.run(ReflectiveCallable.java:12) at org.junit.runners.model.FrameworkMethod.invokeExplosively(FrameworkMethod.java:47) at org.junit.internal.runners.statements.InvokeMethod.evaluate(InvokeMethod.java:17) at org.junit.internal.runners.statements.RunBefores.evaluate(RunBefores.java:26) at org.junit.runners.ParentRunner.runLeaf(ParentRunner.java:325) at org.junit.runners.BlockJUnit4ClassRunner.runChild(BlockJUnit4ClassRunner.java:78) at org.ops4j.pax.exam.invoker.junit.internal.ContainerTestRunner.runChild(ContainerTestRunner.java:68) at org.ops4j.pax.exam.invoker.junit.internal.ContainerTestRunner.runChild(ContainerTestRunner.java:37) at org.junit.runners.ParentRunner$3.run(ParentRunner.java:290) at org.junit.runners.ParentRunner$1.schedule(ParentRunner.java:71) at org.junit.runners.ParentRunner.runChildren(ParentRunner.java:288) at org.junit.runners.ParentRunner.access$000(ParentRunner.java:58) at org.junit.runners.ParentRunner$2.evaluate(ParentRunner.java:268) at org.junit.runners.ParentRunner.run(ParentRunner.java:363) at org.junit.runner.JUnitCore.run(JUnitCore.java:137) at org.junit.runner.JUnitCore.run(JUnitCore.java:115) at org.ops4j.pax.exam.invoker.junit.internal.JUnitProbeInvoker.invokeViaJUnit(JUnitProbeInvoker.java:124) at org.ops4j.pax.exam.invoker.junit.internal.JUnitProbeInvoker.findAndInvoke(JUnitProbeInvoker.java:97) at org.ops4j.pax.exam.invoker.junit.internal.JUnitProbeInvoker.call(JUnitProbeInvoker.java:73) at sun.reflect.NativeMethodAccessorImpl.invoke0(Native Method) at sun.reflect.NativeMethodAccessorImpl.invoke(NativeMethodAccessorImpl.java:62) at sun.reflect.DelegatingMethodAccessorImpl.invoke(DelegatingMethodAccessorImpl.java:43) at java.lang.reflect.Method.invoke(Method.java:497) at org.ops4j.pax.exam.rbc.internal.RemoteBundleContextImpl.remoteCall(RemoteBundleContextImpl.java:80) at sun.reflect.NativeMethodAccessorImpl.invoke0(Native Method) at sun.reflect.NativeMethodAccessorImpl.invoke(NativeMethodAccessorImpl.java:62) at sun.reflect.DelegatingMethodAccessorImpl.invoke(DelegatingMethodAccessorImpl.java:43) at java.lang.reflect.Method.invoke(Method.java:497) at sun.rmi.server.UnicastServerRef.dispatch(UnicastServerRef.java:323) at sun.rmi.transport.Transport$1.run(Transport.java:200) at sun.rmi.transport.Transport$1.run(Transport.java:197) at java.security.AccessController.doPrivileged(Native Method) at sun.rmi.transport.Transport.serviceCall(Transport.java:196) at sun.rmi.transport.tcp.TCPTransport.handleMessages(TCPTransport.java:568) at sun.rmi.transport.tcp.TCPTransport$ConnectionHandler.run0(TCPTransport.java:826) at sun.rmi.transport.tcp.TCPTransport$ConnectionHandler.lambda$run$241(TCPTransport.java:683) at sun.rmi.transport.tcp.TCPTransport$ConnectionHandler$$Lambda$1/800505818.run(Unknown Source) at java.security.AccessController.doPrivileged(Native Method) at sun.rmi.transport.tcp.TCPTransport$ConnectionHandler.run(TCPTransport.java:682) at java.util.concurrent.ThreadPoolExecutor.runWorker(ThreadPoolExecutor.java:1142) at java.util.concurrent.ThreadPoolExecutor$Worker.run(ThreadPoolExecutor.java:617) at java.lang.Thread.run(Thread.java:745)

installFeature(org.opendaylight.odlparent.featuretest.SingleFeatureTest)[repoUrl: file:/home/odldev/git/hello/features/target/classes/features.xml, Feature: odl-hello-ui 1.0.0-SNAPSHOT] Time elapsed: 18.777 sec <<< ERROR! java.io.IOException: Error resolving artifact org.opendaylight.aaa:features-aaa-shiro:xml:features:0.3.0-SNAPSHOT: Could not find artifact org.opendaylight.aaa:features-aaa-shiro:xml:features:0.3.0-SNAPSHOT at org.ops4j.pax.url.mvn.internal.AetherBasedResolver.resolve(AetherBasedResolver.java:355) at org.ops4j.pax.url.mvn.internal.AetherBasedResolver.resolveFile(AetherBasedResolver.java:313) at org.ops4j.pax.url.mvn.internal.AetherBasedResolver.resolve(AetherBasedResolver.java:297) at org.ops4j.pax.url.mvn.internal.Connection.getInputStream(Connection.java:131) at org.apache.karaf.features.internal.FeatureValidationUtil.load(FeatureValidationUtil.java:93) at org.apache.karaf.features.internal.FeatureValidationUtil.validate(FeatureValidationUtil.java:58) at org.apache.karaf.features.internal.FeaturesServiceImpl.validateRepository(FeaturesServiceImpl.java:162) at org.apache.karaf.features.internal.FeaturesServiceImpl.internalAddRepository(FeaturesServiceImpl.java:233) at org.apache.karaf.features.internal.FeaturesServiceImpl.getFeatures(FeaturesServiceImpl.java:813) at org.apache.karaf.features.internal.FeaturesServiceImpl.getFeature(FeaturesServiceImpl.java:771) at org.apache.karaf.features.internal.FeaturesServiceImpl.installFeature(FeaturesServiceImpl.java:359) at org.apache.karaf.features.internal.FeaturesServiceImpl.installFeature(FeaturesServiceImpl.java:347) at Proxyc3a10f39e0c1426fa80b4c32b1e260f0.installFeature(Unknown Source) at org.opendaylight.odlparent.featuretest.SingleFeatureTest.installFeature(SingleFeatureTest.java:207) at sun.reflect.NativeMethodAccessorImpl.invoke0(Native Method) at sun.reflect.NativeMethodAccessorImpl.invoke(NativeMethodAccessorImpl.java:62) at sun.reflect.DelegatingMethodAccessorImpl.invoke(DelegatingMethodAccessorImpl.java:43) at java.lang.reflect.Method.invoke(Method.java:497) at org.junit.runners.model.FrameworkMethod$1.runReflectiveCall(FrameworkMethod.java:50) at org.junit.internal.runners.model.ReflectiveCallable.run(ReflectiveCallable.java:12) at org.junit.runners.model.FrameworkMethod.invokeExplosively(FrameworkMethod.java:47) at org.junit.internal.runners.statements.InvokeMethod.evaluate(InvokeMethod.java:17) at org.junit.internal.runners.statements.RunBefores.evaluate(RunBefores.java:26) at org.junit.runners.ParentRunner.runLeaf(ParentRunner.java:325) at org.junit.runners.BlockJUnit4ClassRunner.runChild(BlockJUnit4ClassRunner.java:78) at org.ops4j.pax.exam.invoker.junit.internal.ContainerTestRunner.runChild(ContainerTestRunner.java:68) at org.ops4j.pax.exam.invoker.junit.internal.ContainerTestRunner.runChild(ContainerTestRunner.java:37) at org.junit.runners.ParentRunner$3.run(ParentRunner.java:290) at org.junit.runners.ParentRunner$1.schedule(ParentRunner.java:71) at org.junit.runners.ParentRunner.runChildren(ParentRunner.java:288) at org.junit.runners.ParentRunner.access$000(ParentRunner.java:58) at org.junit.runners.ParentRunner$2.evaluate(ParentRunner.java:268) at org.junit.runners.ParentRunner.run(ParentRunner.java:363) at org.junit.runner.JUnitCore.run(JUnitCore.java:137) at org.junit.runner.JUnitCore.run(JUnitCore.java:115) at org.ops4j.pax.exam.invoker.junit.internal.JUnitProbeInvoker.invokeViaJUnit(JUnitProbeInvoker.java:124) at org.ops4j.pax.exam.invoker.junit.internal.JUnitProbeInvoker.findAndInvoke(JUnitProbeInvoker.java:97) at org.ops4j.pax.exam.invoker.junit.internal.JUnitProbeInvoker.call(JUnitProbeInvoker.java:73) at sun.reflect.NativeMethodAccessorImpl.invoke0(Native Method) at sun.reflect.NativeMethodAccessorImpl.invoke(NativeMethodAccessorImpl.java:62) at sun.reflect.DelegatingMethodAccessorImpl.invoke(DelegatingMethodAccessorImpl.java:43) at java.lang.reflect.Method.invoke(Method.java:497) at org.ops4j.pax.exam.rbc.internal.RemoteBundleContextImpl.remoteCall(RemoteBundleContextImpl.java:80) at sun.reflect.NativeMethodAccessorImpl.invoke0(Native Method) at sun.reflect.NativeMethodAccessorImpl.invoke(NativeMethodAccessorImpl.java:62) at sun.reflect.DelegatingMethodAccessorImpl.invoke(DelegatingMethodAccessorImpl.java:43) at java.lang.reflect.Method.invoke(Method.java:497) at sun.rmi.server.UnicastServerRef.dispatch(UnicastServerRef.java:323) at sun.rmi.transport.Transport$1.run(Transport.java:200) at sun.rmi.transport.Transport$1.run(Transport.java:197) at java.security.AccessController.doPrivileged(Native Method) at sun.rmi.transport.Transport.serviceCall(Transport.java:196) at sun.rmi.transport.tcp.TCPTransport.handleMessages(TCPTransport.java:568) at sun.rmi.transport.tcp.TCPTransport$ConnectionHandler.run0(TCPTransport.java:826) at sun.rmi.transport.tcp.TCPTransport$ConnectionHandler.lambda$run$241(TCPTransport.java:683) at sun.rmi.transport.tcp.TCPTransport$ConnectionHandler$$Lambda$1/722776432.run(Unknown Source) at java.security.AccessController.doPrivileged(Native Method) at sun.rmi.transport.tcp.TCPTransport$ConnectionHandler.run(TCPTransport.java:682) at java.util.concurrent.ThreadPoolExecutor.runWorker(ThreadPoolExecutor.java:1142) at java.util.concurrent.ThreadPoolExecutor$Worker.run(ThreadPoolExecutor.java:617) at java.lang.Thread.run(Thread.java:745)

Results :

Tests in error: Error resolving artifact org.opendaylight.aaa:features-aaa-shiro:xml:features:0.3.0-SNAPSHOT: Could not find artifact org.opendaylight.aaa:features-aaa-shiro:xml:features:0.3.0-SNAPSHOT Error resolving artifact org.opendaylight.aaa:features-aaa-shiro:xml:features:0.3.0-SNAPSHOT: Could not find artifact org.opendaylight.aaa:features-aaa-shiro:xml:features:0.3.0-SNAPSHOT Error resolving artifact org.opendaylight.aaa:features-aaa-shiro:xml:features:0.3.0-SNAPSHOT: Could not find artifact org.opendaylight.aaa:features-aaa-shiro:xml:features:0.3.0-SNAPSHOT Error resolving artifact org.opendaylight.aaa:features-aaa-shiro:xml:features:0.3.0-SNAPSHOT: Could not find artifact org.opendaylight.aaa:features-aaa-shiro:xml:features:0.3.0-SNAPSHOT

Tests run: 4, Failures: 0, Errors: 4, Skipped: 0

[INFO] ------------------------------------------------------------------------ [INFO] Reactor Summary: [INFO] [INFO] hello-api .......................................... SUCCESS [ 23.109 s] [INFO] hello-impl ......................................... SUCCESS [ 17.715 s] [INFO] hello-features ..................................... FAILURE [01:29 min] [INFO] hello-karaf ........................................ SKIPPED [INFO] hello-artifacts .................................... SKIPPED [INFO] hello-it ........................................... SKIPPED [INFO] hello .............................................. SKIPPED [INFO] ------------------------------------------------------------------------ [INFO] BUILD FAILURE [INFO] ------------------------------------------------------------------------ [INFO] Total time: 02:22 min [INFO] Finished at: 2016-01-02T09:06:27+00:00 [INFO] Final Memory: 98M/794M [INFO] ------------------------------------------------------------------------ [ERROR] Failed to execute goal org.apache.maven.plugins:maven-surefire-plugin:2.18:test (default-test) on project hello-features: There are test failures. [ERROR] [ERROR] Please refer to /home/odldev/git/hello/features/target/surefire-reports for the individual test results. [ERROR] -> [Help 1] [ERROR] [ERROR] To see the full stack trace of the errors, re-run Maven with the -e switch. [ERROR] Re-run Maven using the -X switch to enable full debug logging. [ERROR] [ERROR] For more information about the errors and possible solutions, please read the following articles: [ERROR] [Help 1] http://cwiki.apache.org/confluence/display/MAVEN/MojoFailureException [ERROR] [ERROR] After correcting the problems, you can resume the build with the command [ERROR] mvn <goals> -rf :hello-features odldev@ODLDev:~/git/hello$