Failed to execute goal on project distribution.opendaylight-karaf

asked 2015-11-23 03:28:17 -0700

karthik330 gravatar image

HI I am getting the following error .if i am downloading the required jar externally, this error gone .But throwing the same error for another project..What is the solution for this??I have set all proxy settings..Can anyone help me out from this?I am struggling from last 2 days.

[INFO] BUILD FAILURE [INFO] ------------------------------------------------------------------------ [INFO] Total time: 03:17 min [INFO] Finished at: 2015-11-23T03:06:57-08:00 [INFO] Final Memory: 59M/314M [INFO] ------------------------------------------------------------------------ [ERROR] Failed to execute goal on project distribution.opendaylight-karaf: Could not resolve dependencies for project org.opendaylight.controller:distribution.opendaylight-karaf:pom:1.4.7-SNAPSHOT: The following artifacts could not be resolved: orbit:javax.mail.glassfish:jar:1.4.1.v201108011116, org.springframework:org.springframework.context.support:jar:3.1.3.RELEASE: Could not transfer artifact orbit:javax.mail.glassfish:jar:1.4.1.v201108011116 from/to opendaylight-mirror ( http://nexus.opendaylight.org/content... ): GET request of: orbit/javax.mail.glassfish/1.4.1.v201108011116/javax.mail.glassfish-1.4.1.v201108011116.jar from opendaylight-mirror failed: Connection reset -> [Help 1] [ERROR] [ERROR] To see the full stack trace of the errors, re-run Maven with the -e switch. [ERROR] Re-run Maven using the -X switch to enable full debug logging. [ERROR] [ERROR] For more information about the errors and possible solutions, please read the following articles: [ERROR] [Help 1] http://cwiki.apache.org/confluence/di... karthik@ubuntu:~/stable-helium/controller-stable-helium/opendaylight/distribution/opendaylight-karaf$

edit retag flag offensive close merge delete