ODL compilation issue with karaf-parent

asked 2015-01-12 22:19:27 -0800

skrasheed.blr gravatar image

updated 2015-01-13 10:39:51 -0800

Moderators

Hi,

Today I am facing a compilation issue with the karaf-parent, actually I have not touched this component in my development. Please let me know how to fix this issue?

Thanks in advance..

Logs:

====

[INFO] adsal-parent ...................................... SUCCESS [0.145s]
[INFO] concepts .......................................... SUCCESS [0.946s]
[INFO] filter-valve ...................................... SUCCESS [0.781s]
[INFO] karaf-parent ...................................... FAILURE [1.354s]
[INFO] features-extras ................................... SKIPPED
[INFO] features-restconf ................................. SKIPPED
[INFO] features-neutron .................................. SKIPPED
[INFO] features-netconf-connector ........................ SKIPPED
[INFO] distribution.opendaylight-karaf ................... SKIPPED
[INFO] karaf-aggregator .................................. SKIPPED
[INFO] features-controller ............................... SKIPPED
[INFO] odl-model-project ................................. SKIPPED
[INFO] opendaylight-configfile-archetype ................. SKIPPED
[INFO] archetypes-parent ................................. SKIPPED
[INFO] distribution-karaf-archetype ...................... SKIPPED
[INFO] opendaylight-karaf-features-archetype ............. SKIPPED
[INFO] ------------------------------------------------------------------------
[INFO] BUILD FAILURE
[INFO] ------------------------------------------------------------------------
[INFO] Total time: 8:25.245s
[INFO] Finished at: Tue Jan 13 10:53:49 IST 2015
[INFO] Final Memory: 444M/989M
[INFO] ------------------------------------------------------------------------
[ERROR] Failed to execute goal org.apache.karaf.tooling:karaf-maven-plugin:3.0.2:install-kars (process-resources) on project karaf-parent: Feature standard is not resolved. Check that <dependencies/> provide the kar of features repository providing this feature (with compile or runtime scope) -> [Help 1]
org.apache.maven.lifecycle.LifecycleExecutionException: Failed to execute goal org.apache.karaf.tooling:karaf-maven-plugin:3.0.2:install-kars (process-resources) on project karaf-parent: Feature standard is not resolved. Check that <dependencies/> provide the kar of features repository providing this feature (with compile or runtime scope)
 at org.apache.maven.lifecycle.internal.MojoExecutor.execute(MojoExecutor.java:213)
 at org.apache.maven.lifecycle.internal.MojoExecutor.execute(MojoExecutor.java:153)
 at org.apache.maven.lifecycle.internal.MojoExecutor.execute(MojoExecutor.java:145)
 at org.apache.maven.lifecycle.internal.MojoExecutor.executeForkedExecutions(MojoExecutor.java:365)
 at org.apache.maven.lifecycle.internal.MojoExecutor.execute(MojoExecutor.java:199)
 at org.apache.maven.lifecycle.internal.MojoExecutor.execute(MojoExecutor.java:153)
 at org.apache.maven.lifecycle.internal.MojoExecutor.execute(MojoExecutor.java:145)
 at org.apache.maven.lifecycle.internal.LifecycleModuleBuilder.buildProject(LifecycleModuleBuilder.java:84)
 at org.apache.maven.lifecycle.internal.LifecycleModuleBuilder.buildProject(LifecycleModuleBuilder.java:59)
 at org.apache.maven.lifecycle.internal.LifecycleStarter.singleThreadedBuild(LifecycleStarter.java:183)
 at org.apache.maven.lifecycle.internal.LifecycleStarter.execute(LifecycleStarter.java:161)
 at org.apache.maven.DefaultMaven.doExecute(DefaultMaven.java:320)
 at org.apache.maven.DefaultMaven.execute(DefaultMaven.java:156)
 at org.apache.maven.cli.MavenCli.execute(MavenCli.java:537)
 at org.apache.maven.cli.MavenCli.doMain(MavenCli.java:196)
 at org.apache.maven.cli.MavenCli.main(MavenCli.java:141)
 at sun.reflect.NativeMethodAccessorImpl.invoke0(Native Method)
 at sun.reflect.NativeMethodAccessorImpl.invoke(NativeMethodAccessorImpl.java:57)
 at sun.reflect.DelegatingMethodAccessorImpl.invoke(DelegatingMethodAccessorImpl.java:43)
 at java.lang.reflect.Method.invoke(Method.java:606)
 at org.codehaus.plexus.classworlds.launcher.Launcher.launchEnhanced(Launcher.java:289)
 at org.codehaus.plexus.classworlds.launcher.Launcher.launch(Launcher.java:229)
 at org.codehaus.plexus.classworlds.launcher.Launcher.mainWithExitCode(Launcher.java:415)
 at org.codehaus.plexus.classworlds.launcher.Launcher.main(Launcher.java:356)
Caused by: org.apache.maven.plugin.MojoFailureException: Feature standard is not resolved. Check that <dependencies/> provide the kar of features repository providing this feature (with compile or runtime scope)
 at org.apache.karaf.tooling.features.InstallKarsMojo.execute(InstallKarsMojo.java:209)
 at org.apache.maven.plugin.DefaultBuildPluginManager.executeMojo(DefaultBuildPluginManager.java:101 ...
(more)
edit retag flag offensive close merge delete

Comments

Hi! were you able to solve this issue? please let me know because I am facing the same.

Manish ( 2016-06-03 23:52:12 -0800 )edit