features-integration-test fails

asked 2017-03-10 15:19:58 -0800

adolfo gravatar image

Folks,

I cloned the eman project's repo, made changes to the code base.

If I run

$ rm -r ~/.m2/repository/org/opendaylight $ <top_directory>/mvn clean install

I get

[INFO] eman-api ........................................... SUCCESS [ 35.294 s] [INFO] eman-impl .......................................... SUCCESS [ 24.036 s] [INFO] eman-features ...................................... SUCCESS [03:38 min] [INFO] eman-karaf ......................................... SUCCESS [ 27.512 s] [INFO] eman-artifacts ..................................... SUCCESS [ 1.622 s] [INFO] eman-it ............................................ SUCCESS [01:08 min] [INFO] org.opendaylight.eman:eman-aggregator .............. SUCCESS [ 20.407 s] [INFO] ------------------------------------------------------------------------ [INFO] BUILD SUCCESS

However, after committing the changes (commit f26446eb443cb235c7a0aa338e1256f799b5f9f1) and got the following from Jenkins:

https://jenkins.opendaylight.org/rele... : SUCCESS https://jenkins.opendaylight.org/rele... : SUCCESS https://jenkins.opendaylight.org/rele... : FAILURE

Digging a bit deeper I found the following in the Jenkings logs I found:

[INFO] ODL :: integration :: all-artifacts ................ SUCCESS [ 0.823 s] [INFO] ODL :: integration :: distribution-artifacts ....... SUCCESS [ 0.010 s] [INFO] ODL :: integration :: upstream-artifacts ........... SUCCESS [ 0.012 s] [INFO] ODL :: integration :: artifacts-aggregator ......... SUCCESS [ 0.010 s] [INFO] ODL :: integration :: version ...................... SUCCESS [ 7.215 s] [INFO] ODL :: integration :: features-distribution ........ SUCCESS [ 23.047 s] [INFO] ODL :: integration :: features-integration-index ... SUCCESS [ 8.820 s] [INFO] ODL :: integration :: features-integration-test .... FAILURE [ 58.245 s] [INFO] ODL :: integration :: distribution-karaf ........... SKIPPED [INFO] Integration/Distribution ........................... SKIPPED [INFO] ------------------------------------------------------------------------ [INFO] BUILD FAILURE

Have you experience this problem?

Will you please provide pointers to solving "features-integration-test" issue?

Thanks,

Adolfo

edit retag flag offensive close merge delete

Comments

can you run maven command with debug, i.e mvn --debug embedded into your regular mvn command.

sunilkumarms ( 2017-03-24 07:39:22 -0800 )edit