Ask Your Question
0

compiling bgpcep project of Beryllium release failed

asked 2016-07-21 01:16:06 -0700

hi_movee gravatar image

my build command is : mvn clean install -Dcheckstyle.skip=true -DskipTests

and i tried these tags: origin/master, release/beryllium, release/beryllium-sr1, release/beryllium-sr2, stable/beryllium.

then i got the same errors.

the error messages:

[INFO] 100 errors [INFO] ------------------------------------------------------------- [INFO] ------------------------------------------------------------------------ [INFO] Reactor Summary: [INFO] [INFO] bgpcep-artifacts ................................... SUCCESS [ 4.032 s] [INFO] BGPCEP common parent ............................... SUCCESS [ 35.309 s] [INFO] concepts ........................................... SUCCESS [02:52 min] [INFO] rsvp-parent ........................................ SUCCESS [ 2.045 s] [INFO] rsvp-api ........................................... SUCCESS [ 42.817 s] [INFO] util ............................................... SUCCESS [ 22.229 s] [INFO] rsvp-spi ........................................... SUCCESS [ 44.635 s] [INFO] rsvp-impl .......................................... SUCCESS [ 25.053 s] [INFO] programming-parent ................................. SUCCESS [ 2.071 s] [INFO] programming-controller-config ...................... SUCCESS [ 2.237 s] [INFO] rsvp-controller-config ............................. SUCCESS [ 1.512 s] [INFO] bgp-parent ......................................... SUCCESS [ 3.873 s] [INFO] bgp-concepts ....................................... SUCCESS [ 28.764 s] [INFO] features-rsvp ...................................... SUCCESS [02:16 min] [INFO] bgp-parser-api ..................................... SUCCESS [ 41.405 s] [INFO] bgp-parser-spi ..................................... SUCCESS [ 24.650 s] [INFO] bgp-rib-api ........................................ SUCCESS [ 19.314 s] [INFO] bgp-bmp-api ........................................ SUCCESS [ 46.162 s] [INFO] bgp-inet ........................................... SUCCESS [ 29.286 s] [INFO] bgp-rib-spi ........................................ SUCCESS [03:07 min] [INFO] bgp-parser-impl .................................... SUCCESS [ 26.279 s] [INFO] bgp-linkstate ...................................... FAILURE [02:39 min] [INFO] bgp-flowspec ....................................... SKIPPED [INFO] bgp-labeled-unicast ................................ SKIPPED [INFO] bgp-l3vpn .......................................... SKIPPED [INFO] bgp-evpn ........................................... SKIPPED [INFO] bgp-path-selection-mode ............................ SKIPPED [INFO] bgp-openconfig-spi ................................. SKIPPED [INFO] bgp-rib-mock ....................................... SKIPPED [INFO] bgp-util ........................................... SKIPPED [INFO] bgp-rib-impl ....................................... SKIPPED [INFO] topology-parent .................................... SKIPPED [INFO] topology-api ....................................... SKIPPED [INFO] bgp-topology-provider .............................. SKIPPED [INFO] bgp-benchmark-app .................................. SKIPPED [INFO] data-change-counter ................................ SKIPPED [INFO] bgp-controller-config .............................. SKIPPED [INFO] data-change-counter-controller-config .............. SKIPPED [INFO] topology-tunnel-api ................................ SKIPPED [INFO] topology-segment-routing ........................... SKIPPED [INFO] bgp-openconfig-api ................................. SKIPPED [INFO] bgp-openconfig-impl ................................ SKIPPED [INFO] features-bgp ....................................... SKIPPED [INFO] pcep-parent ........................................ SKIPPED [INFO] pcep-controller-config ............................. SKIPPED [INFO] pcep-api ........................................... SKIPPED [INFO] pcep-spi ........................................... SKIPPED [INFO] pcep-impl .......................................... SKIPPED [INFO] programming-api .................................... SKIPPED [INFO] programming-topology-api ........................... SKIPPED [INFO] pcep-topology-api .................................. SKIPPED [INFO] programming-tunnel-api ............................. SKIPPED [INFO] pcep-tunnel-api .................................... SKIPPED [INFO] pcep-ietf-stateful07 ............................... SKIPPED [INFO] programming-spi .................................... SKIPPED [INFO] pcep-topology-spi .................................. SKIPPED [INFO] programming-impl ................................... SKIPPED [INFO] testtool-util ...................................... SKIPPED [INFO] pcep-pcc-mock ...................................... SKIPPED [INFO] pcep-topology-provider ............................. SKIPPED [INFO] pcep-segment-routing ............................... SKIPPED [INFO] pcep-tunnel-provider ............................... SKIPPED [INFO] pcep-auto-bandwidth-extension ...................... SKIPPED [INFO] features-pcep ...................................... SKIPPED [INFO] features-extras .................................... SKIPPED [INFO] bgp-bmp-spi ........................................ SKIPPED [INFO] bgp-bmp-impl ....................................... SKIPPED [INFO] features-bmp ....................................... SKIPPED [INFO] features-bgpcep .................................... SKIPPED [INFO] bgp-parser-mock .................................... SKIPPED [INFO] bgp-testtool ....................................... SKIPPED [INFO] bmp-mock ........................................... SKIPPED [INFO] pcep-testtool ...................................... SKIPPED [INFO] integration-tests .................................. SKIPPED [INFO] distribution-karaf ................................. SKIPPED [INFO] bgpcep ............................................. SKIPPED [INFO] ------------------------------------------------------------------------ [INFO] BUILD FAILURE [INFO] ------------------------------------------------------------------------ [INFO] Total time: 18:20 min [INFO] Finished at: 2016-07-21T15:44:53+08:00 [INFO] Final Memory: 223M/656M [INFO] ------------------------------------------------------------------------ [ERROR] Failed to execute goal org.apache.maven.plugins:maven-compiler-plugin:3.5.1:compile (default-compile) on project bgp-linkstate: Compilation failure: Compilation failure: [ERROR] /Users/baidu/Documents/ideajava/bgpcep/bgp/linkstate/target/generated-sources/sal/org/opendaylight/yang/gen/v1/urn/opendaylight/params/xml/ns/yang/bgp/linkstate/rev150210/linkstate/path/attribute/link/state/attribute/link/attributes/case/LinkAttributes.java:[6,96] cannot find symbol [ERROR] symbol: class LinkState [ERROR] location: package org.opendaylight.yang.gen.v1.urn.opendaylight.params.xml.ns.yang.bgp.linkstate.rev150210 [ERROR] /Users/baidu/Documents/ideajava/bgpcep/bgp/linkstate/target/generated-sources/sal/org/opendaylight/yang/gen/v1/urn/opendaylight/params/xml/ns/yang/bgp/linkstate/rev150210/linkstate/path/attribute/link/state/attribute/link/attributes/case/LinkAttributes.java:[239,5] cannot find symbol [ERROR] symbol: class LinkState [ERROR] /Users/baidu/Documents ... (more)

edit retag flag offensive close merge delete

1 answer

Sort by ยป oldest newest most voted
0

answered 2016-07-26 05:55:28 -0700

Milos Fabian gravatar image

This compilation problems is happening on Windows and Mac OSes (path/file name case sensitivity not supported - "Linkstate"/"LinkState"). I recommand to use Linux-based OS for building bgpcep project.

edit flag offensive delete publish link more

Comments

thks, i had tested under linux environment, and it works well

hi_movee ( 2016-07-26 19:59:51 -0700 )edit

Your Answer

Please start posting anonymously - your entry will be published after you log in or create a new account.

Add Answer

[hide preview]

Question Tools

Follow
1 follower

Stats

Asked: 2016-07-21 01:16:06 -0700

Seen: 23 times

Last updated: Jul 26 '16