OpenFlow plugin errors

asked 2014-11-17 21:04:06 -0700

Srijit Nair gravatar image

Hi, I am seeing some test failure while building the OpenFlowplugin distribution. Following is the log output : Tests run: 9, Failures: 0, Errors: 9, Skipped: 0

[INFO] ------------------------------------------------------------------------ [INFO] Reactor Summary: [INFO] [INFO] openflowplugin-parent ............................. SUCCESS [6.581s] [INFO] openflowplugin-api ................................ SUCCESS [12.838s] [INFO] openflowplugin-extension-parent ................... SUCCESS [0.151s] [INFO] openflowplugin-extension-api ...................... SUCCESS [50.824s] [INFO] openflowplugin .................................... SUCCESS [1:51.833s] [INFO] openflowjava-extension-nicira-api ................. SUCCESS [3.258s] [INFO] openflowjava-extension-nicira ..................... SUCCESS [5.554s] [INFO] openflowplugin-extension-nicira ................... SUCCESS [29.969s] [INFO] test-extension .................................... SUCCESS [17.579s] [INFO] openflowplugin-controller-config .................. SUCCESS [22.344s] [INFO] test-common ....................................... SUCCESS [1.860s] [INFO] test-provider ..................................... SUCCESS [2:18.410s] [INFO] drop-test ......................................... SUCCESS [1.906s] [INFO] applications ...................................... SUCCESS [0.077s] [INFO] table-miss-enforcer ............................... SUCCESS [25.758s] [INFO] lldp-speaker ...................................... SUCCESS [30.515s] [INFO] Opendaylight OpenflowPlugin Base Edition .......... SUCCESS [7:25.048s] [INFO] Opendaylight OpenflowPlugin CBENCH Edition ........ SUCCESS [19.092s] [INFO] of-switch-config-pusher ........................... SUCCESS [15.190s] [INFO] drop-test-karaf ................................... SUCCESS [1.378s] [INFO] features-openflowplugin ........................... FAILURE [52:25.029s] [INFO] openflowplugin-karaf .............................. SKIPPED [INFO] openflowplugin-it ................................. SKIPPED [INFO] sample-consumer ................................... SKIPPED [INFO] learning-switch ................................... SKIPPED [INFO] ------------------------------------------------------------------------ [INFO] BUILD FAILURE [INFO] ------------------------------------------------------------------------ [INFO] Total time: 1:08:15.902s [INFO] Finished at: Tue Nov 18 10:30:20 IST 2014 [INFO] Final Memory: 99M/508M [INFO] ------------------------------------------------------------------------ [ERROR] Failed to execute goal org.apache.maven.plugins:maven-surefire-plugin:2.16:test (default-test) on project features-openflowplugin: There are test failures. [ERROR]

I think it should be fine to still go ahead and run the application. Has anyone else encountered these errors ? Thanks, Srijit

edit retag flag offensive close merge delete