Ask is moving to Stack Overflow and Serverfault.com! Please use the "opendaylight" tag on either of these sites. This site is now in Read-Only mode

Revision history [back]

click to hide/show revision 1
initial version

Hm. Well. I pulled the yangtools project also (git clone ssh://${ODL_USERNAME}@git.opendaylight.org:29418/yangtools.git) and it seemed as if the build went beyond the first part of the error. But then it still failed compiling a bunch of northbound pieces:

[INFO] topology.northbound ................................ FAILURE [ 0.978 s] [INFO] forwarding.staticrouting.northbound ................ FAILURE [ 1.318 s] [INFO] statistics.northbound .............................. FAILURE [ 0.358 s] [INFO] flowprogrammer.northbound .......................... FAILURE [ 0.353 s] [INFO] hosttracker.northbound ............................. FAILURE [ 0.397 s] [INFO] subnets.northbound ................................. FAILURE [ 0.579 s] [INFO] switchmanager.northbound ........................... FAILURE [ 1.132 s] [INFO] containermanager.northbound ........................ FAILURE [ 0.687 s] [INFO] networkconfig.bridgedomain.northbound .............. FAILURE [ 0.296 s] [INFO] connectionmanager.northbound ....................... FAILURE [ 0.288 s] [INFO] usermanager.northbound ............................. FAILURE [ 0.192 s] [INFO] controllermanager.northbound ....................... FAILURE [ 3.663 s] [INFO] samples.loadbalancer.northbound .................... FAILURE [ 0.267 s] [INFO] networkconfig.neutron.northbound ................... FAILURE [ 1.384 s]

[INFO] BUILD FAILURE [INFO] ------------------------------------------------------------------------ [INFO] Total time: 14:42 min [INFO] Finished at: 2015-01-25T15:30:08-08:00 [INFO] Final Memory: 287M/363M [INFO] ------------------------------------------------------------------------ [ERROR] Failed to execute goal org.codehaus.enunciate:maven-enunciate-plugin:1.28:docs (default) on project topology.northbound: Execution default of goal org.codehaus.enunciate:maven-enunciate-plugin:1.28:docs failed: A required class was missing while executing org.codehaus.enunciate:maven-enunciate-plugin:1.28:docs: com/sun/mirror/apt/AnnotationProcessorFactory [ERROR] ----------------------------------------------------- .....

I suppose I need to look at what is going on with this one now.

Siva